program: Orca
programVersion: 5.0.2
elementType: S O N C C C C C C C C C C C C C C H H H H H H H H H H H H H H H H H H H H H
charge: 0
multiplicity: 1
keywords: wb97x-d3
keywords: def2-TZVPP
keywords: def2/J RIJCOSX
keywords: DEFGRID2
keywords: scfconv7
keywords: smallprint printgap noloewdin
keywords: NOSOSCF
formula: C14H21NOS
InChI: InChI=1/C14H21NOS/c1-3-10-15(11-4-2)14(16)17-12-13-8-6-5-7-9-13/h5-9H,3-4,10-12H2,1-2H3
38 atoms
S  -0.164842 -1.45652 0.476546
O  -0.401015 0.849674 1.743964
N  -2.010722 0.43201 0.203639
C  -2.709796 1.676263 0.487185
C  -2.598048 -0.440566 -0.794282
C  -2.42823 2.772289 -0.53619
C  -3.573317 -1.46345 -0.22123
C  -0.890106 0.135376 0.898644
C  -0.961765 3.166652 -0.630131
C  -4.176508 -2.33317 -1.31383
C  1.433397 -1.301242 1.332112
C  2.484506 -0.657179 0.479579
C  3.29473 -1.435603 -0.341163
C  2.658854 0.724278 0.478781
C  4.25921 -0.851571 -1.147813
C  3.621347 1.309745 -0.329702
C  4.424064 0.525566 -1.145536
H  -2.428501 2.014433 1.483041
H  -3.782212 1.462981 0.516344
H  -1.809243 -0.942932 -1.359186
H  -3.114867 0.191877 -1.520591
H  -2.791211 2.464339 -1.521702
H  -3.030832 3.641532 -0.258586
H  -3.05489 -2.087627 0.510193
H  -4.366687 -0.943646 0.322968
H  -0.342211 2.338488 -0.975175
H  -0.827538 3.987506 -1.334923
H  -0.571824 3.485966 0.336174
H  -4.881002 -3.054976 -0.902348
H  -4.714539 -1.734685 -2.051389
H  -3.405749 -2.894065 -1.844863
H  1.265625 -0.759006 2.261534
H  1.711508 -2.324062 1.589154
H  3.169837 -2.512376 -0.35001
H  2.03417 1.341319 1.111085
H  4.88299 -1.472805 -1.777487
H  3.746211 2.384887 -0.319331
H  5.176611 0.98474 -1.773198
totalener: -1074.40437469 hartree
nucrepener: 1353.50961797 hartree
electener: -2427.91399266 hartree
oneelecener: -4155.10661495 hartree
twoeener: 1727.19262229 hartree
kineticenergy: 1070.58003587 hartree
xcener: -87.040308508963 hartree
chargesum: -0.0000000
charge: -0.109735 -0.426783 -0.123455 -0.066368 -0.129012 -0.105926 -0.058112 0.285334 -0.238387 -0.255851 -0.105613 0.057556 -0.187360 -0.174381 -0.111109 -0.109735 -0.140076 0.105199 0.092069 0.105063 0.096388 0.050410 0.065589 0.063777 0.056162 0.071788 0.087435 0.088773 0.088796 0.072518 0.081600 0.133735 0.124149 0.103163 0.143622 0.121246 0.124071 0.123458
qa: -0.1097 -0.4268 -0.1235 -0.0664 -0.1290 -0.1059 -0.0581 0.2853 -0.2384 -0.2559 -0.1056 0.0576 -0.1874 -0.1744 -0.1111 -0.1097 -0.1401 0.1052 0.0921 0.1051 0.0964 0.0504 0.0656 0.0638 0.0562 0.0718 0.0874 0.0888 0.0888 0.0725 0.0816 0.1337 0.1241 0.1032 0.1436 0.1212 0.1241 0.1235
va: 2.3086 2.0707 3.1269 3.8641 3.9052 3.8996 3.8323 4.2793 3.9285 3.9454 3.8212 3.6363 4.0447 3.9702 3.9510 3.9449 3.9703 1.0244 1.0011 1.0216 0.9976 1.0099 1.0143 1.0313 1.0152 1.0087 1.0063 1.0074 1.0056 1.0035 1.0034 1.0306 1.0055 1.0128 1.0159 1.0007 1.0013 1.0000
dispcorr: -0.017087665 hartree
energy: -1074.421462354950
dipole: -16.16381 15.43595 -0.72786 5.24423 -5.36058 -0.11635 -7.72577 7.05472 -0.67104
magnitude: 0.99680 au
magnitude: 2.53367 debye
