program: Orca
programVersion: 5.0.2
elementType: Cl O O N C C C C C C C C C C C C C C C H H H H H H H H H H H H H H H H H H H H H H
charge: 0
multiplicity: 1
keywords: wb97x-d3
keywords: def2-TZVPP
keywords: def2/J RIJCOSX
keywords: DEFGRID2
keywords: scfconv7
keywords: smallprint printgap noloewdin
keywords: NOSOSCF
formula: C15H22ClNO2
InChI: InChI=1/C15H22ClNO2/c1-5-13-8-6-7-12(4)15(13)17(14(18)9-16)10-19-11(2)3/h6-8,11H,5,9-10H2,1-4H3
41 atoms
Cl 1.743244 1.334317 2.480023
O  -2.420424 -0.362244 -1.113672
O  -1.339078 1.969322 1.335737
N  -0.516106 0.172911 0.222814
C  0.601955 -0.537695 -0.313527
C  1.163247 -1.574491 0.446636
C  1.076119 -0.219805 -1.590642
C  -1.811506 -0.486983 0.137003
C  0.624418 -1.942295 1.806912
C  2.220354 -2.291274 -0.106464
C  -3.037125 0.891555 -1.421073
C  2.143143 -0.956067 -2.098448
C  -0.393644 1.3678 0.849063
C  2.706665 -1.986847 -1.367511
C  0.481715 0.868394 -2.435081
C  1.677538 -2.39103 2.810994
C  -3.394812 0.840103 -2.893031
C  -4.26616 1.15126 -0.565305
C  1.001004 1.953721 0.971204
H  -2.43909 -0.130664 0.95429
H  -1.652851 -1.554556 0.284836
H  0.076227 -1.101754 2.23118
H  -0.114677 -2.740712 1.684736
H  2.673193 -3.099822 0.452142
H  -2.316877 1.704414 -1.269905
H  2.529814 -0.715646 -3.081233
H  3.531334 -2.554227 -1.779085
H  0.010294 1.661071 -1.857851
H  1.248302 1.325826 -3.059423
H  -0.277185 0.464547 -3.10744
H  1.218017 -2.539763 3.788216
H  2.463523 -1.643667 2.923273
H  2.148276 -3.333386 2.532706
H  -3.845857 1.783491 -3.199737
H  -2.515051 0.675768 -3.516438
H  -4.113914 0.044499 -3.09787
H  -4.035376 1.235734 0.496594
H  -5.008083 0.360993 -0.693443
H  -4.725195 2.093745 -0.86522
H  0.92141 3.033707 1.062923
H  1.669442 1.712988 0.150447
elementType: Cl O N C H
totalener: -1250.35945967 hartree
nucrepener: 1706.78565914 hartree
electener: -2957.14511882 hartree
oneelecener: -5101.31968517 hartree
twoeener: 2144.17456635 hartree
cpcmener: -0.02976038 hartree
kineticenergy: 1246.03870205 hartree
xcener: -99.068641135626 hartree
chargesum: -0.0000000
charge: -0.152116 -0.390819 -0.520660 0.017366 0.061403 -0.099654 -0.137566 0.082545 -0.184580 -0.099407 0.146699 -0.094487 0.305665 -0.183490 -0.305338 -0.267372 -0.265649 -0.267375 -0.060123 0.128129 0.131997 0.091510 0.099672 0.146558 0.062879 0.142045 0.159339 0.096766 0.117766 0.119592 0.096580 0.079126 0.091414 0.089631 0.097218 0.091088 0.088989 0.089318 0.096266 0.151770 0.147304
qa: -0.1521 -0.3908 -0.5207 0.0174 0.0614 -0.0997 -0.1376 0.0825 -0.1846 -0.0994 0.1467 -0.0945 0.3057 -0.1835 -0.3053 -0.2674 -0.2656 -0.2674 -0.0601 0.1281 0.1320 0.0915 0.0997 0.1466 0.0629 0.1420 0.1593 0.0968 0.1178 0.1196 0.0966 0.0791 0.0914 0.0896 0.0972 0.0911 0.0890 0.0893 0.0963 0.1518 0.1473
va: 1.1259 1.9319 1.9718 2.9361 3.7019 3.7467 3.8216 3.9154 3.8658 3.8108 3.8276 3.8340 4.1079 3.9587 3.9269 3.9264 3.9142 3.9015 3.9572 0.9962 0.9957 1.0077 1.0001 0.9967 0.9999 0.9983 0.9910 1.0066 0.9999 0.9934 1.0037 1.0129 1.0006 1.0058 1.0061 1.0078 1.0145 1.0102 1.0064 1.0087 1.0096
dispcorr: -0.024079718 hartree
energy: -1250.383539392684
dipole: -13.58340 14.28948 0.70609 -5.44209 4.94894 -0.49315 -12.84418 11.55625 -1.28793
magnitude: 1.54936 au
magnitude: 3.93816 debye
