program: Orca
programVersion: 5.0.2
elementType: Cl O O N C C C C C C C C C C C C C C C H H H H H H H H H H H H H H H H H H H H H H
charge: 0
multiplicity: 1
keywords: wb97x-d3
keywords: def2-TZVPP
keywords: def2/J RIJCOSX
keywords: DEFGRID2
keywords: scfconv7
keywords: smallprint printgap noloewdin
keywords: NOSOSCF
formula: C15H22ClNO2
InChI: InChI=1/C15H22ClNO2/c1-5-13-8-6-7-12(4)15(13)17(14(18)9-16)10-19-11(2)3/h6-8,11H,5,9-10H2,1-4H3
41 atoms
Cl 2.300159 2.450165 0.815133
O  -2.309088 -0.468177 -0.969321
O  -1.093518 2.449906 0.501958
N  -0.233058 0.519607 -0.318263
C  0.823897 -0.441687 -0.331783
C  0.825945 -1.511584 0.567137
C  1.834042 -0.286897 -1.292279
C  -1.26646 0.386229 -1.33617
C  -0.262682 -1.748114 1.580159
C  1.887172 -2.41393 0.51075
C  -3.314715 0.055506 -0.093943
C  2.866916 -1.216015 -1.321121
C  -0.241435 1.5750 0.531546
C  2.89894 -2.269865 -0.420922
C  1.810915 0.822746 -2.301182
C  -1.052743 -3.017941 1.276136
C  -4.143274 1.140789 -0.761793
C  -4.182768 -1.116709 0.318257
C  0.874295 1.660511 1.557183
H  -0.809715 -0.064884 -2.215519
H  -1.612636 1.381504 -1.616898
H  0.190618 -1.837207 2.570339
H  -0.943949 -0.899416 1.634076
H  1.915101 -3.240166 1.211155
H  -2.84389 0.464234 0.807284
H  3.657821 -1.105005 -2.05272
H  3.716212 -2.978907 -0.446865
H  1.219074 0.542081 -3.175639
H  1.389265 1.747142 -1.911221
H  2.818185 1.039174 -2.654582
H  -1.838794 -3.16913 2.016424
H  -0.411355 -3.899545 1.291408
H  -1.521868 -2.964077 0.294083
H  -3.55634 2.015326 -1.042912
H  -4.640236 0.759432 -1.655846
H  -4.914009 1.486397 -0.072132
H  -4.969073 -0.774797 0.991178
H  -3.607499 -1.878725 0.844113
H  -4.661873 -1.58071 -0.546208
H  1.193981 0.700894 1.951641
H  0.54197 2.289399 2.378555
elementType: Cl O N C H
totalener: -1250.35985756 hartree
nucrepener: 1713.13320520 hartree
electener: -2963.49306276 hartree
oneelecener: -5114.06987982 hartree
twoeener: 2150.57681706 hartree
cpcmener: -0.02899655 hartree
kineticenergy: 1246.04664532 hartree
xcener: -99.068935576866 hartree
chargesum: 0.0000000
charge: -0.153340 -0.391268 -0.517776 0.019925 0.126494 -0.163339 -0.178442 0.086463 -0.158865 -0.091937 0.138438 -0.067906 0.301352 -0.198254 -0.280520 -0.295491 -0.266468 -0.270543 -0.051494 0.128907 0.132339 0.101366 0.083802 0.144376 0.063136 0.140711 0.158480 0.115315 0.095982 0.109590 0.100375 0.101332 0.079180 0.089546 0.089235 0.095740 0.093268 0.105331 0.090450 0.143709 0.150802
qa: -0.1533 -0.3913 -0.5178 0.0199 0.1265 -0.1633 -0.1784 0.0865 -0.1589 -0.0919 0.1384 -0.0679 0.3014 -0.1983 -0.2805 -0.2955 -0.2665 -0.2705 -0.0515 0.1289 0.1323 0.1014 0.0838 0.1444 0.0631 0.1407 0.1585 0.1153 0.0960 0.1096 0.1004 0.1013 0.0792 0.0895 0.0892 0.0957 0.0933 0.1053 0.0904 0.1437 0.1508
va: 1.1213 1.9322 1.9719 2.9473 3.5617 3.7814 3.8533 3.9012 3.8366 3.8055 3.8308 3.8099 4.1153 3.9592 3.9355 3.9136 3.9069 3.9110 3.9538 0.9982 0.9930 1.0019 1.0191 0.9970 1.0032 0.9996 0.9905 0.9948 1.0105 1.0003 0.9994 1.0080 1.0153 1.0140 1.0098 1.0069 1.0076 1.0005 1.0096 1.0118 1.0104
dispcorr: -0.024526318 hartree
energy: -1250.384383873857
dipole: -21.35778 21.67287 0.31509 -15.37674 13.96940 -1.40735 -2.23383 2.52541 0.29158
magnitude: 1.47137 au
magnitude: 3.73992 debye
