program: Orca
programVersion: 5.0.2
elementType: Cl O O N C C C C C C C C C C C C C C C H H H H H H H H H H H H H H H H H H H H H H
charge: 0
multiplicity: 1
keywords: wb97x-d3
keywords: def2-TZVPP
keywords: def2/J RIJCOSX
keywords: DEFGRID2
keywords: scfconv7
keywords: smallprint printgap noloewdin
keywords: NOSOSCF
formula: C15H22ClNO2
InChI: InChI=1/C15H22ClNO2/c1-5-13-8-6-7-12(4)15(13)17(14(18)9-16)10-19-11(2)3/h6-8,11H,5,9-10H2,1-4H3
41 atoms
Cl 2.270701 2.337543 0.986898
O  -2.264494 -0.371789 -1.243114
O  -1.117613 2.410891 0.649893
N  -0.260796 0.566847 -0.353671
C  0.740833 -0.449631 -0.420311
C  0.617058 -1.618545 0.340678
C  1.805606 -0.262759 -1.311579
C  -1.249587 0.571413 -1.422874
C  -0.512269 -1.856024 1.310747
C  1.594255 -2.600861 0.193408
C  -3.303637 -0.032502 -0.319973
C  2.763543 -1.26511 -1.418499
C  -0.275087 1.527493 0.601203
C  2.658416 -2.428166 -0.674253
C  1.924278 0.952788 -2.182904
C  -0.03914 -2.198509 2.720235
C  -4.200513 1.070989 -0.858811
C  -4.083491 -1.306025 -0.06329
C  0.83106 1.493952 1.638723
H  -0.743915 0.296006 -2.347858
H  -1.629472 1.586348 -1.542473
H  -1.164824 -0.986718 1.36454
H  -1.132259 -2.673967 0.934096
H  1.516975 -3.517088 0.765524
H  -2.863092 0.29802 0.628074
H  3.596612 -1.129478 -2.097452
H  3.407926 -3.202907 -0.771799
H  1.390567 1.81719 -1.795805
H  2.969199 1.235542 -2.304731
H  1.529671 0.747291 -3.180446
H  0.59817 -1.413037 3.128666
H  0.521567 -3.132357 2.752518
H  -0.894572 -2.309967 3.386748
H  -4.66294 0.774525 -1.801784
H  -4.996783 1.276991 -0.143458
H  -3.666853 2.008226 -1.018617
H  -4.885423 -1.115129 0.649447
H  -3.447622 -2.087852 0.354623
H  -4.536099 -1.685053 -0.98164
H  1.137313 0.494486 1.931615
H  0.501719 2.038868 2.519184
elementType: Cl O N C H
totalener: -1250.35955081 hartree
nucrepener: 1711.65119610 hartree
electener: -2962.01074691 hartree
oneelecener: -5110.96139385 hartree
twoeener: 2148.95064694 hartree
cpcmener: -0.03010795 hartree
kineticenergy: 1246.04502031 hartree
xcener: -99.069050189913 hartree
chargesum: 0.0000000
charge: -0.156010 -0.392540 -0.519250 0.012624 0.093152 -0.144768 -0.153755 0.094455 -0.191152 -0.088460 0.148289 -0.077245 0.307032 -0.193834 -0.301453 -0.255722 -0.271536 -0.265456 -0.040342 0.132472 0.125406 0.090308 0.100874 0.147234 0.063767 0.140436 0.158284 0.095102 0.112768 0.121169 0.082129 0.088393 0.095570 0.089010 0.096076 0.090608 0.090426 0.097325 0.090507 0.136260 0.151847
qa: -0.1560 -0.3925 -0.5193 0.0126 0.0932 -0.1448 -0.1538 0.0945 -0.1912 -0.0885 0.1483 -0.0772 0.3070 -0.1938 -0.3015 -0.2557 -0.2715 -0.2655 -0.0403 0.1325 0.1254 0.0903 0.1009 0.1472 0.0638 0.1404 0.1583 0.0951 0.1128 0.1212 0.0821 0.0884 0.0956 0.0890 0.0961 0.0906 0.0904 0.0973 0.0905 0.1363 0.1518
va: 1.1212 1.9289 1.9723 2.9503 3.6428 3.8117 3.8353 3.8995 3.8948 3.7959 3.8147 3.8242 4.1073 3.9535 3.9340 3.9185 3.9141 3.9176 3.9590 0.9933 0.9991 1.0031 0.9990 0.9956 1.0020 0.9988 0.9910 1.0113 0.9985 0.9936 1.0039 1.0043 1.0044 1.0102 1.0061 1.0109 1.0057 1.0059 1.0088 1.0224 1.0084
dispcorr: -0.024228236 hartree
energy: -1250.383779042819
dipole: -19.22861 19.48420 0.25558 -13.92511 12.44828 -1.47682 -0.83381 1.02985 0.19604
magnitude: 1.51154 au
magnitude: 3.84203 debye
