program: Gaussian 09
title: 000056294
version: EM64L-G09RevD.01
frameworkgroup: C1[X(C18H19NO8S)]
method: RPBEPBE
basis: SDD
operation: Freq
keyword: #p
keyword: freq=noraman
keyword: PBEPBE/SDD
title: #p freq=noraman PBEPBE/SDD
converged: YES YES NO NO
title: Mulliken charges:
elementType: S O O O O O O O O N C C C C C C C C C C C C C C C C C C H H H H H H H H H H H H H H H H H H H
charge: 0.150984 -0.270135 -0.393592 -0.295712 -0.205485 -0.415758 -0.420107 -0.238077 -0.281548 -0.374803 0.032352 0.289353 0.366386 0.058192 -0.852058 0.246517 -0.588696 0.012832 0.368230 -0.695282 -0.108733 -0.033977 -0.487113 -0.451962 0.179109 0.263756 -0.532912 -0.771146 0.295590 0.313531 0.296656 0.295571 0.313967 0.295680 0.268298 0.200005 0.256254 0.339172 0.394283 0.254335 0.235831 0.234448 0.339810 0.254923 0.253873 0.216646 0.390512
chargesum: 0.00000
title: Mulliken charges with hydrogens summed into heavy atoms:
elementType: S O O O O O O O O N C C C C C C C C C C C C C C C C C C
charge: 0.150984 -0.270135 0.000691 -0.295712 -0.205485 -0.075948 -0.029595 -0.238077 -0.281548 -0.035631 0.032352 0.289353 0.366386 0.058192 -0.242937 0.246517 -0.292040 0.012832 0.368230 -0.085744 0.186948 -0.033977 -0.218815 0.004296 0.179109 0.263756 0.191702 -0.045705
polarizability: 3.98499791e+02 -5.84074048e+00 2.69621052e+02 1.21850704e+01 2.87375409e+01 1.89358649e+02
1716.lowfreq: -6.2759 -1.3234 -0.0013 0.0009 0.0010 1.1513 8.3291 18.0391 25.4117
frequency: 4.8423 17.9634 25.3862 29.8422 42.2756 46.4217 51.5062 55.6692 65.3931 66.3097 73.8947 93.3682 116.8101 123.2365 134.3200 142.7241 162.1661 166.3336 177.8586 202.0887 220.8399 225.7513 245.4907 256.1146 282.4296 289.9543 316.9197 338.7239 349.3146 354.4815 363.5564 377.0367 381.8905 402.4111 443.3773 456.0751 462.6805 496.1711 502.3572 515.3475 517.1249 538.0814 543.9049 585.1477 592.6613 602.3637 608.2746 614.2729 624.8955 637.4957 650.2260 666.7223 715.7700 717.0295 743.1485 762.2566 783.9078 797.0105 813.4076 859.6332 892.3181 897.7847 917.1460 921.6596 936.0185 947.1334 947.6742 956.8071 981.4070 981.7406 994.7481 1035.1991 1043.9351 1078.8316 1100.5605 1112.1472 1134.5127 1149.0002 1155.6002 1168.0292 1182.2395 1191.7521 1209.3598 1222.8873 1230.0874 1243.1234 1248.1972 1271.4923 1286.3783 1303.9897 1316.9985 1325.9713 1329.8588 1336.8960 1374.7964 1390.2547 1390.8737 1412.9356 1427.2225 1430.4338 1435.0451 1446.7893 1450.1190 1450.8508 1456.2354 1463.8620 1469.7513 1472.4491 1481.9910 1530.6957 1554.5563 1566.0397 1600.4130 1607.8394 1634.4731 1660.9868 2720.2651 2968.2715 2980.3679 2985.8724 2999.3420 3052.2622 3061.5230 3077.5980 3098.8201 3104.5544 3112.0676 3132.2063 3132.2714 3138.6661 3142.3629 3168.0910 3519.0651 3545.6348 3574.1214
redmass: 7.5133 6.8443 6.2003 5.5171 5.9126 5.8933 4.9853 5.8745 1.6667 2.9500 4.5862 4.2758 8.2755 7.7329 4.8068 6.8950 4.0300 4.2540 5.2719 5.8895 1.7420 2.2315 4.2675 3.0616 3.5342 3.6116 3.6526 5.1856 2.7456 3.1736 1.9710 3.5088 4.3574 6.7603 7.1317 2.8619 9.5127 8.1654 4.0748 3.9028 6.5443 1.3924 7.1427 5.5593 3.2646 5.0949 3.5871 3.9036 3.8270 6.6748 1.7222 3.6432 4.6327 5.6744 5.5644 6.2491 5.3144 6.0095 3.0276 2.5074 1.8319 2.3927 2.6680 2.9155 1.9326 4.7156 1.0722 3.2290 2.5807 3.2037 1.5893 3.3453 1.6535 1.8697 3.6311 1.2589 2.3192 1.8555 1.1882 1.8383 1.5846 1.5105 1.7695 1.7361 1.5068 1.4189 1.2756 3.1588 1.7012 1.3376 1.4047 2.1862 2.3663 3.7802 1.3653 1.2511 2.2414 4.6601 1.1338 4.4691 2.1211 1.2570 1.0475 1.6157 1.2167 1.2022 1.0643 1.0601 1.8110 6.6094 4.8856 4.7264 5.5874 6.2173 6.7008 9.1206 1.0725 1.0801 1.0319 1.0684 1.0359 1.0579 1.0573 1.1050 1.0982 1.1007 1.0956 1.1073 1.0928 1.1014 1.1083 1.0908 1.0642 1.0666 1.0785
irintensity: 0.4439 1.7771 0.2634 6.8693 0.3646 2.0369 1.7290 4.3035 9.4904 3.8598 1.2438 4.3300 2.0266 6.3136 2.4575 5.9927 2.7005 5.0447 6.4106 1.2423 4.1274 6.9289 2.6832 7.3460 3.0899 25.5252 1.9662 14.5326 24.7847 30.1151 95.7519 3.4959 21.4062 53.1341 1.7607 9.7919 31.0928 4.6854 32.4006 34.9078 30.9273 121.2263 2.9504 24.5210 59.0541 4.8454 5.2415 9.1276 29.6427 10.1291 127.9898 0.7877 16.6003 0.2597 14.3040 4.5433 19.1433 3.0324 5.5489 7.0428 74.9038 2.3360 7.8238 31.1870 6.1983 33.7525 129.8594 2.6075 63.6228 22.9529 5.3973 67.8877 14.1946 207.7168 109.4556 0.4281 8.7597 10.5867 62.2532 6.9671 24.7288 85.0637 2.4012 5.0922 0.8724 8.2140 9.5300 54.8005 102.5059 40.3329 15.3414 23.3790 219.3553 364.3685 55.7041 63.2760 205.4992 38.2178 28.5963 24.2025 10.5131 17.7158 15.6139 36.7101 4.7515 128.5894 30.0688 18.4424 247.9060 247.4883 67.9035 31.5097 121.4315 156.1963 22.9342 203.9912 163.2494 19.4128 49.5433 71.2705 9.2948 5.4062 3.4265 28.1760 9.6005 16.8400 1.8759 4.7166 8.3710 13.3265 2.6369 1.0519 38.9674 14.0063 40.4108
temp: 298.150 k
press: 1.00000 atm
elementType: 16 8 8 8 8 8 8 8 8 7 6 6 6 6 6 6 6 6 6 6 6 6 6 6 6 6 6 6 1 1 1 1 1 1 1 1 1 1 1 1 1 1 1 1 1 1 1
symmnumber: 1
zpe: 913505.1 jmol-1
zpe.correction: 0.347936 hartree
zpe.thermalcorrener: 0.376797 hartree
zpe.thermalcorrenthalpy: 0.377741 hartree
zpe.thermalcorrgfe: 0.282961 hartree
zpe.sumelectzpe: -1749.862536 hartree
zpe.sumelectthermal: -1749.833675 hartree
zpe.sumelectthermalent: -1749.832731 hartree
zpe.sumelectthermalfe: -1749.927511 hartree
dipole: -0.8128 1.7917 -2.0053
dipole: 2.8093
quadrupole: -156.4772 -174.5346 -171.1065
quadrupole: 17.0270 16.6548 -1.9624
quadrupole: 10.8956 -7.1618 -3.7338 17.0270 16.6548 -1.9624
hfenergy: -1750.2104718 hartree
pointgroup: C01 [X(C18H19N1O8S1)]
dipole: -0.2896057 -0.0522126 1.0653805 debye
polarizability: 397.760063|2.298823|264.9998203|-16.7880229|-34.9515577|194.7196083 unknown
InChI: InChI=1S/C18H19NO8S/c1-8(21)19-12(18(25)26)7-28-6-11-14(27-2)4-10-13(22)3-9(5-20)16(23)15(10)17(11)24/h3-4,12,19-20,24-25H,5-7H2,1-2H3
charge 0 multiplicity 1
47 atoms
S  -2.099796 0.703263 -0.548454
O  -0.458607 -1.866562 1.654462
O  1.17368 2.29791 -0.01723
O  3.594345 2.49601 -0.759476
O  4.566626 -2.755679 0.542038
O  6.020039 1.423394 -2.878568
O  -5.435062 1.363971 1.447833
O  -3.943913 -0.028699 2.552215
O  -5.798423 -1.966694 -1.834162
N  -5.316464 0.075126 -0.85238
C  2.724709 0.416008 0.068442
C  0.353827 0.206295 0.819709
C  2.948971 -0.947894 0.419999
C  1.421177 0.98356 0.284367
C  -0.995017 0.830112 1.02471
C  0.624111 -1.151772 1.144831
C  1.911475 -1.72577 0.958454
C  3.78976 1.240311 -0.489698
C  5.130176 0.627456 -0.727033
C  -3.090596 -0.869143 -0.167407
C  -4.558086 -0.559406 0.227716
C  4.303673 -1.547591 0.229239
C  5.354308 -0.674282 -0.350192
C  6.191239 1.466891 -1.410468
C  -4.592147 0.2502 1.520892
C  -5.905033 -0.699567 -1.838531
C  -0.24221 -3.253697 2.096561
C  -6.672907 0.059538 -2.912647
H  -0.900417 1.913464 1.188067
H  -1.557993 0.361049 1.844111
H  2.134865 -2.764054 1.218568
H  -3.094315 -1.482741 -1.081395
H  -2.565576 -1.404919 0.638015
H  -5.041371 -1.540401 0.427977
H  6.338898 -1.14212 -0.477369
H  7.203886 1.125339 -1.116319
H  6.062573 2.529921 -1.159541
H  -5.421887 1.089969 -0.838625
H  2.057474 2.702615 -0.384069
H  -1.216781 -3.579447 2.486583
H  0.51785 -3.298571 2.897864
H  0.060239 -3.896883 1.249846
H  6.113839 0.484323 -3.184576
H  -6.208085 -0.134165 -3.894878
H  -7.7051 -0.327669 -2.958012
H  -6.704293 1.149202 -2.742367
H  -5.408261 1.855797 2.3129
