program: Orca
programVersion: 5.0.2
elementType: Cl O O N C C C C C C C C C C C C C C C H H H H H H H H H H H H H H H H H H H H H H
charge: 0
multiplicity: 1
keywords: wb97x-d3
keywords: def2-TZVPP
keywords: def2/J RIJCOSX
keywords: DEFGRID2
keywords: scfconv7
keywords: smallprint printgap noloewdin
keywords: NOSOSCF
formula: C15H22ClNO2
InChI: InChI=1/C15H22ClNO2/c1-5-13-8-6-7-12(4)15(13)17(14(18)9-16)10-19-11(2)3/h6-8,11H,5,9-10H2,1-4H3
41 atoms
Cl 1.752153 3.089858 1.884517
O  -2.000651 0.516092 -1.311735
O  -0.796755 2.048841 1.039225
N  -0.153278 0.128525 0.0436
C  0.89219 -0.766449 -0.341292
C  1.229044 -1.824892 0.506727
C  1.5351 -0.575189 -1.57155
C  -1.524721 -0.23849 -0.226215
C  0.528555 -2.076496 1.814242
C  2.23567 -2.699475 0.101474
C  -3.420351 0.630911 -1.41955
C  2.536768 -1.467224 -1.935668
C  0.089808 1.280453 0.716268
C  2.885562 -2.523302 -1.106623
C  1.16766 0.553396 -2.487717
C  -0.47298 -3.225037 1.717458
C  -4.124601 -0.716344 -1.391656
C  -3.9916 1.595035 -0.391009
C  1.547251 1.524682 1.07063
H  -2.124587 -0.085968 0.675591
H  -1.532751 -1.306534 -0.456438
H  1.277265 -2.32324 2.570097
H  0.020087 -1.179151 2.167851
H  2.511272 -3.523907 0.748335
H  -3.567267 1.067609 -2.410139
H  3.049015 -1.330836 -2.880031
H  3.668707 -3.208038 -1.405316
H  1.843068 0.585936 -3.340826
H  0.155754 0.443253 -2.876016
H  1.216777 1.524104 -1.991737
H  -1.255901 -3.015658 0.988049
H  -0.954741 -3.398084 2.680294
H  0.017525 -4.153012 1.42128
H  -3.688695 -1.41212 -2.109864
H  -4.097679 -1.179722 -0.403448
H  -5.173627 -0.584629 -1.658322
H  -3.907886 1.217186 0.629239
H  -5.051866 1.754158 -0.58987
H  -3.49818 2.565793 -0.441449
H  2.180771 1.5223 0.185243
H  1.907406 0.744174 1.741355
elementType: Cl O N C H
totalener: -1250.35915679 hartree
nucrepener: 1669.86452045 hartree
electener: -2920.22367724 hartree
oneelecener: -5027.56922664 hartree
twoeener: 2107.34554939 hartree
cpcmener: -0.03749578 hartree
kineticenergy: 1246.04916032 hartree
xcener: -99.068570056163 hartree
chargesum: -0.0000000
charge: -0.154759 -0.395498 -0.507898 -0.017524 0.105658 -0.155826 -0.190208 0.082950 -0.144933 -0.064066 0.198956 -0.052760 0.309609 -0.196210 -0.277705 -0.269497 -0.304277 -0.301328 -0.072124 0.133931 0.131694 0.092959 0.081762 0.144493 0.069484 0.142293 0.158878 0.101748 0.105310 0.103695 0.087132 0.096346 0.087336 0.098979 0.091106 0.101148 0.086599 0.100105 0.089323 0.151847 0.151271
qa: -0.1548 -0.3955 -0.5079 -0.0175 0.1057 -0.1558 -0.1902 0.0829 -0.1449 -0.0641 0.1990 -0.0528 0.3096 -0.1962 -0.2777 -0.2695 -0.3043 -0.3013 -0.0721 0.1339 0.1317 0.0930 0.0818 0.1445 0.0695 0.1423 0.1589 0.1017 0.1053 0.1037 0.0871 0.0963 0.0873 0.0990 0.0911 0.1011 0.0866 0.1001 0.0893 0.1518 0.1513
va: 1.1226 1.9086 1.9947 2.9784 3.5583 3.8315 3.8901 3.9212 3.8824 3.7867 3.8862 3.7772 4.1165 3.9611 3.9512 3.9157 3.9198 3.9242 4.0078 0.9735 0.9845 1.0005 1.0141 0.9968 0.9912 0.9995 0.9902 1.0050 1.0139 0.9934 1.0036 1.0041 1.0033 1.0066 0.9985 1.0063 1.0051 1.0080 1.0142 1.0011 1.0024
dispcorr: -0.022302145 hartree
energy: -1250.381458939183
dipole: -19.12796 19.40512 0.27715 -19.15757 16.35481 -2.80276 -8.65802 7.99193 -0.66610
magnitude: 2.89413 au
magnitude: 7.35629 debye
