program: Orca
programVersion: 5.0.2
elementType: Cl O O N C C C C C C C C C C C C C C C H H H H H H H H H H H H H H H H H H H H H H
charge: 0
multiplicity: 1
keywords: wb97x-d3
keywords: def2-TZVPP
keywords: def2/J RIJCOSX
keywords: DEFGRID2
keywords: scfconv7
keywords: smallprint printgap noloewdin
keywords: NOSOSCF
formula: C15H22ClNO2
InChI: InChI=1/C15H22ClNO2/c1-5-13-8-6-7-12(4)15(13)17(14(18)9-16)10-19-11(2)3/h6-8,11H,5,9-10H2,1-4H3
41 atoms
Cl 1.286437 2.890703 2.202618
O  -2.186698 -0.486223 -1.262616
O  -0.803844 2.399328 0.283768
N  -0.085274 0.444121 -0.609545
C  0.889102 -0.601035 -0.648133
C  0.754281 -1.732108 0.161602
C  1.940717 -0.47296 -1.567611
C  -1.145207 0.380835 -1.603543
C  -0.336244 -1.884769 1.190198
C  1.687961 -2.757622 0.008926
C  -3.136016 -0.016151 -0.300995
C  2.8539 -1.512822 -1.679347
C  0.006855 1.491878 0.246725
C  2.721883 -2.654735 -0.903051
C  2.085622 0.754295 -2.417223
C  0.192588 -2.190832 2.588097
C  -3.990032 1.11735 -0.845112
C  -3.98363 -1.212346 0.083173
C  1.2184 1.452337 1.163941
H  -0.715287 -0.019784 -2.521008
H  -1.489008 1.39423 -1.813222
H  -0.945092 -0.984029 1.240553
H  -1.008813 -2.688046 0.877432
H  1.59742 -3.652202 0.612556
H  -2.611094 0.333844 0.595948
H  3.672206 -1.427791 -2.383521
H  3.43283 -3.464123 -1.007096
H  1.315084 0.805807 -3.189707
H  2.01398 1.672968 -1.833337
H  3.050115 0.757096 -2.922781
H  0.730983 -3.137418 2.629688
H  -0.633462 -2.254647 3.296806
H  0.867708 -1.408245 2.937475
H  -3.411694 2.014217 -1.067709
H  -4.515583 0.813519 -1.752281
H  -4.737612 1.398783 -0.10287
H  -4.544918 -1.593146 -0.772444
H  -4.701279 -0.927113 0.85211
H  -3.374211 -2.023772 0.483368
H  2.141601 1.409084 0.586886
H  1.186746 0.57619 1.810119
elementType: Cl O N C H
totalener: -1250.36234382 hartree
nucrepener: 1689.84314562 hartree
electener: -2940.20548944 hartree
oneelecener: -5067.03245068 hartree
twoeener: 2126.82696124 hartree
cpcmener: -0.03393320 hartree
kineticenergy: 1246.03717256 hartree
xcener: -99.068438656222 hartree
chargesum: -0.0000000
charge: -0.154848 -0.391693 -0.507283 -0.007099 0.116809 -0.149194 -0.177624 0.087216 -0.200904 -0.092348 0.140928 -0.064562 0.311711 -0.190038 -0.260775 -0.258495 -0.266457 -0.266541 -0.071426 0.129296 0.127291 0.090856 0.099413 0.146589 0.064642 0.142077 0.158760 0.106595 0.104369 0.103775 0.089728 0.094535 0.085109 0.089449 0.090001 0.095306 0.091157 0.090439 0.097158 0.152107 0.153969
qa: -0.1548 -0.3917 -0.5073 -0.0071 0.1168 -0.1492 -0.1776 0.0872 -0.2009 -0.0923 0.1409 -0.0646 0.3117 -0.1900 -0.2608 -0.2585 -0.2665 -0.2665 -0.0714 0.1293 0.1273 0.0909 0.0994 0.1466 0.0646 0.1421 0.1588 0.1066 0.1044 0.1038 0.0897 0.0945 0.0851 0.0894 0.0900 0.0953 0.0912 0.0904 0.0972 0.1521 0.1540
va: 1.1240 1.9296 1.9884 2.9544 3.5912 3.8209 3.8993 3.9189 3.9023 3.7949 3.8207 3.7952 4.1059 3.9525 3.9515 3.9189 3.9039 3.9196 3.9963 0.9947 0.9951 1.0027 0.9993 0.9973 1.0010 1.0000 0.9909 0.9953 0.9952 1.0031 1.0042 1.0046 1.0001 1.0136 1.0108 1.0063 1.0080 1.0058 1.0058 1.0032 1.0016
dispcorr: -0.023418093 hartree
energy: -1250.385761909838
dipole: -14.00260 14.91640 0.91380 -16.07519 14.26974 -1.80545 -5.93886 5.30434 -0.63452
magnitude: 2.12068 au
magnitude: 5.39034 debye
