program: Orca
programVersion: 5.0.2
elementType: Cl O O N C C C C C C C C C C C C C C C H H H H H H H H H H H H H H H H H H H H H H
charge: 0
multiplicity: 1
keywords: wb97x-d3
keywords: def2-TZVPP
keywords: def2/J RIJCOSX
keywords: DEFGRID2
keywords: scfconv7
keywords: smallprint printgap noloewdin
keywords: NOSOSCF
formula: C15H22ClNO2
InChI: InChI=1/C15H22ClNO2/c1-5-13-8-6-7-12(4)15(13)17(14(18)9-16)10-19-11(2)3/h6-8,11H,5,9-10H2,1-4H3
41 atoms
Cl 2.593283 2.924449 1.25019
O  -2.022259 0.324618 -1.231241
O  -0.392066 2.579972 1.666876
N  -0.330148 0.756814 0.347843
C  0.334595 -0.400038 -0.159266
C  0.209868 -1.617028 0.511278
C  1.061784 -0.285216 -1.350453
C  -1.734227 0.996289 -0.055193
C  -0.540717 -1.765174 1.807094
C  0.834154 -2.736891 -0.036964
C  -2.758259 -0.89967 -1.113296
C  1.675176 -1.42259 -1.861044
C  0.229944 1.633883 1.198731
C  1.559487 -2.643456 -1.210988
C  1.191822 1.03078 -2.055052
C  0.38726 -1.768931 3.018828
C  -4.247632 -0.609006 -1.076778
C  -2.374638 -1.772939 -2.289629
C  1.683054 1.422066 1.582275
H  -1.852927 2.066509 -0.227334
H  -2.402261 0.705128 0.763528
H  -1.286436 -0.978481 1.925842
H  -1.092502 -2.707344 1.781358
H  0.740532 -3.691776 0.466703
H  -2.475088 -1.409761 -0.185739
H  2.242461 -1.351883 -2.780846
H  2.034094 -3.523424 -1.625725
H  1.698033 1.775401 -1.437513
H  1.769527 0.920517 -2.971477
H  0.220163 1.446564 -2.323619
H  0.924969 -0.825872 3.116875
H  1.126928 -2.567928 2.950861
H  -0.182205 -1.920426 3.93637
H  -4.512478 0.032225 -0.23391
H  -4.574721 -0.119172 -1.996077
H  -4.810116 -1.537281 -0.971168
H  -2.922361 -2.714343 -2.249189
H  -1.309073 -2.0077 -2.286238
H  -2.617461 -1.287808 -3.237417
H  2.178872 0.611859 1.057729
H  1.743072 1.233887 2.653615
elementType: Cl O N C H
totalener: -1250.35705594 hartree
nucrepener: 1712.00592966 hartree
electener: -2962.36298560 hartree
oneelecener: -5111.20557405 hartree
twoeener: 2148.84258845 hartree
cpcmener: -0.03427922 hartree
kineticenergy: 1246.03548362 hartree
xcener: -99.065800835505 hartree
chargesum: -0.0000000
charge: -0.163032 -0.395724 -0.548103 0.011470 0.088411 -0.115364 -0.175104 0.057866 -0.168927 -0.087172 0.184775 -0.053233 0.343661 -0.179751 -0.259929 -0.275697 -0.277064 -0.268256 -0.102575 0.122887 0.135831 0.090146 0.093398 0.142604 0.061724 0.140661 0.157673 0.096856 0.101438 0.101032 0.087980 0.088688 0.096735 0.091220 0.089485 0.095129 0.097385 0.083032 0.095698 0.153771 0.160378
qa: -0.1630 -0.3957 -0.5481 0.0115 0.0884 -0.1154 -0.1751 0.0579 -0.1689 -0.0872 0.1848 -0.0532 0.3437 -0.1798 -0.2599 -0.2757 -0.2771 -0.2683 -0.1026 0.1229 0.1358 0.0901 0.0934 0.1426 0.0617 0.1407 0.1577 0.0969 0.1014 0.1010 0.0880 0.0887 0.0967 0.0912 0.0895 0.0951 0.0974 0.0830 0.0957 0.1538 0.1604
va: 1.1105 1.9328 1.9644 2.9790 3.4712 3.7990 3.9076 3.9201 3.8670 3.7903 3.8345 3.7665 4.0741 3.9430 3.9346 3.9222 3.9563 3.9043 3.9843 1.0061 0.9798 1.0032 0.9992 0.9980 0.9869 1.0007 0.9902 1.0110 1.0061 1.0096 1.0057 1.0026 1.0049 1.0046 1.0082 1.0065 1.0074 1.0095 1.0089 1.0015 1.0076
dispcorr: -0.025008238 hartree
energy: -1250.382064178026
dipole: -18.15380 17.74841 -0.40539 -21.48279 18.39167 -3.09112 -6.33499 6.00579 -0.32920
magnitude: 3.13492 au
magnitude: 7.96833 debye
