program: Orca
programVersion: 5.0.2
elementType: Cl O O N C C C C C C C C C C C C C C C H H H H H H H H H H H H H H H H H H H H H H
charge: 0
multiplicity: 1
keywords: wb97x-d3
keywords: def2-TZVPP
keywords: def2/J RIJCOSX
keywords: DEFGRID2
keywords: scfconv7
keywords: smallprint printgap noloewdin
keywords: NOSOSCF
formula: C15H22ClNO2
InChI: InChI=1/C15H22ClNO2/c1-5-13-8-6-7-12(4)15(13)17(14(18)9-16)10-19-11(2)3/h6-8,11H,5,9-10H2,1-4H3
41 atoms
Cl 1.443549 3.076216 1.961059
O  -2.241207 -0.547103 -0.982356
O  -0.758192 2.381061 0.231352
N  -0.068566 0.356836 -0.519494
C  0.950444 -0.64492 -0.541341
C  0.928813 -1.707481 0.363745
C  1.961185 -0.521859 -1.507977
C  -1.175211 0.213296 -1.456453
C  -0.132934 -1.877854 1.416945
C  1.950164 -2.655567 0.284484
C  -3.148333 0.068431 -0.06554
C  2.953011 -1.491427 -1.558509
C  0.058049 1.482769 0.233379
C  2.948393 -2.553771 -0.665473
C  1.999246 0.651001 -2.442436
C  -0.975706 -3.130881 1.196456
C  -3.943768 1.192931 -0.708915
C  -4.066148 -1.032584 0.428977
C  1.306325 1.526627 1.104989
H  -0.796509 -0.324179 -2.325519
H  -1.478983 1.208009 -1.78743
H  0.352422 -1.944523 2.394395
H  -0.781027 -1.003127 1.459737
H  1.960481 -3.482018 0.98542
H  -2.594636 0.466487 0.793202
H  3.740822 -1.410104 -2.297574
H  3.731592 -3.299974 -0.709222
H  2.849755 0.57435 -3.119357
H  1.099953 0.727561 -3.056779
H  2.097037 1.596073 -1.901856
H  -1.738934 -3.219412 1.970683
H  -0.367675 -4.035698 1.233469
H  -1.478752 -3.107381 0.229789
H  -4.651727 1.599699 0.014515
H  -3.320409 2.023883 -1.039213
H  -4.51343 0.830007 -1.566963
H  -4.643125 -1.467409 -0.390044
H  -4.772146 -0.631608 1.156727
H  -3.50951 -1.832553 0.917808
H  2.211616 1.38974 0.515513
H  1.273889 0.733736 1.852469
elementType: Cl O N C H
totalener: -1250.37212536 hartree
nucrepener: 1688.50242720 hartree
electener: -2938.87455256 hartree
oneelecener: -5064.39519810 hartree
twoeener: 2125.52064554 hartree
cpcmener: -0.02649274 hartree
kineticenergy: 1246.02652944 hartree
xcener: -99.063923139343 hartree
chargesum: -0.0000000
charge: -0.151168 -0.373165 -0.470520 0.003517 0.127729 -0.164951 -0.194779 0.073351 -0.172912 -0.085089 0.136061 -0.050339 0.291733 -0.190269 -0.256892 -0.293007 -0.266075 -0.266176 -0.078891 0.125842 0.129571 0.100681 0.084285 0.141136 0.060103 0.139213 0.155538 0.101752 0.106106 0.103898 0.098431 0.098622 0.082164 0.093490 0.089436 0.088722 0.089801 0.091121 0.101715 0.150388 0.149829
qa: -0.1512 -0.3732 -0.4705 0.0035 0.1277 -0.1650 -0.1948 0.0734 -0.1729 -0.0851 0.1361 -0.0503 0.2917 -0.1903 -0.2569 -0.2930 -0.2661 -0.2662 -0.0789 0.1258 0.1296 0.1007 0.0843 0.1411 0.0601 0.1392 0.1555 0.1018 0.1061 0.1039 0.0984 0.0986 0.0822 0.0935 0.0894 0.0887 0.0898 0.0911 0.1017 0.1504 0.1498
va: 1.1265 1.9517 2.0309 2.9408 3.5569 3.8074 3.9284 3.9314 3.8510 3.8056 3.8416 3.7949 4.1245 3.9649 3.9667 3.9172 3.9044 3.9138 3.9972 0.9926 0.9909 1.0005 1.0191 0.9981 1.0031 1.0012 0.9918 1.0047 0.9956 0.9923 0.9990 1.0092 1.0140 1.0075 1.0161 1.0101 1.0093 1.0080 1.0013 0.9999 1.0059
dispcorr: -0.023661065 hartree
energy: -1250.395786425217
dipole: -16.78339 17.65160 0.86821 -17.99483 16.25697 -1.73786 -6.92345 6.41497 -0.50848
magnitude: 2.00811 au
magnitude: 5.10421 debye
