program: Orca
programVersion: 5.0.2
elementType: Cl O O N C C C C C C C C C C C C C C C H H H H H H H H H H H H H H H H H H H H H H
charge: 0
multiplicity: 1
keywords: wb97x-d3
keywords: def2-TZVPP
keywords: def2/J RIJCOSX
keywords: DEFGRID2
keywords: scfconv7
keywords: smallprint printgap noloewdin
keywords: NOSOSCF
formula: C15H22ClNO2
InChI: InChI=1/C15H22ClNO2/c1-5-13-8-6-7-12(4)15(13)17(14(18)9-16)10-19-11(2)3/h6-8,11H,5,9-10H2,1-4H3
41 atoms
Cl 1.546545 3.059367 2.000796
O  -2.219826 -0.514478 -0.876031
O  -0.713173 2.398154 0.33718
N  -0.048958 0.390755 -0.479468
C  0.955436 -0.623789 -0.536309
C  0.946415 -1.691158 0.364196
C  1.936403 -0.512543 -1.534261
C  -1.183275 0.263192 -1.38491
C  -0.089293 -1.85935 1.443322
C  1.951607 -2.652632 0.249895
C  -3.281599 0.177266 -0.212111
C  2.913594 -1.494976 -1.618421
C  0.1007 1.498591 0.29498
C  2.922612 -2.560149 -0.72908
C  1.948795 0.650702 -2.480809
C  -0.980918 -3.075431 1.207115
C  -4.252824 0.757374 -1.226906
C  -3.956923 -0.81772 0.709096
C  1.37781 1.524252 1.124161
H  -0.822706 -0.24218 -2.281393
H  -1.512094 1.263594 -1.673808
H  0.421776 -1.975898 2.402595
H  -0.706552 -0.96618 1.53435
H  1.969252 -3.483516 0.945543
H  -2.872966 0.991809 0.394333
H  3.680126 -1.419918 -2.380045
H  3.694814 -3.315806 -0.798592
H  2.85063 0.639886 -3.091362
H  1.096917 0.635094 -3.163761
H  1.918239 1.608534 -1.958302
H  -1.519743 -2.99633 0.263332
H  -1.717125 -3.173521 2.005902
H  -0.400598 -3.998699 1.182224
H  -4.711297 -0.030901 -1.827598
H  -5.050512 1.30245 -0.720253
H  -3.76443 1.460595 -1.904169
H  -4.796556 -0.345539 1.220093
H  -3.270916 -1.185339 1.473477
H  -4.344098 -1.674973 0.154372
H  2.261206 1.396222 0.50011
H  1.370694 0.718962 1.858777
elementType: Cl O N C H
totalener: -1250.37191553 hartree
nucrepener: 1681.63590768 hartree
electener: -2932.00782321 hartree
oneelecener: -5050.75652015 hartree
twoeener: 2118.74869694 hartree
cpcmener: -0.02606030 hartree
kineticenergy: 1246.03551611 hartree
xcener: -99.064132473610 hartree
chargesum: -0.0000000
charge: -0.151118 -0.377490 -0.475916 0.001533 0.116006 -0.160496 -0.187577 0.093875 -0.178172 -0.082154 0.156171 -0.049644 0.303501 -0.192022 -0.259383 -0.289426 -0.276051 -0.265735 -0.078055 0.123184 0.119090 0.097885 0.078463 0.141615 0.060601 0.139291 0.155528 0.101589 0.105222 0.103784 0.084095 0.097636 0.096916 0.083942 0.093163 0.091176 0.099462 0.089749 0.091189 0.149882 0.148690
qa: -0.1511 -0.3775 -0.4759 0.0015 0.1160 -0.1605 -0.1876 0.0939 -0.1782 -0.0822 0.1562 -0.0496 0.3035 -0.1920 -0.2594 -0.2894 -0.2761 -0.2657 -0.0781 0.1232 0.1191 0.0979 0.0785 0.1416 0.0606 0.1393 0.1555 0.1016 0.1052 0.1038 0.0841 0.0976 0.0969 0.0839 0.0932 0.0912 0.0995 0.0897 0.0912 0.1499 0.1487
va: 1.1271 1.9403 2.0259 2.9556 3.5785 3.7806 3.8985 3.9208 3.8667 3.8052 3.8380 3.7935 4.1108 3.9669 3.9608 3.9123 3.9273 3.9118 4.0048 0.9962 1.0033 1.0009 1.0190 0.9972 1.0135 1.0008 0.9917 1.0040 0.9969 0.9943 1.0170 1.0014 1.0096 1.0090 1.0083 1.0052 1.0092 1.0026 1.0079 1.0002 1.0055
dispcorr: -0.023257626 hartree
energy: -1250.395173155605
dipole: -17.79046 18.50095 0.71049 -18.22957 16.54839 -1.68117 -8.03954 7.29297 -0.74657
magnitude: 1.97193 au
magnitude: 5.01225 debye
