program: Orca
programVersion: 5.0.2
elementType: Cl O O N C C C C C C C C C C C C C C C H H H H H H H H H H H H H H H H H H H H H H
charge: 0
multiplicity: 1
keywords: wb97x-d3
keywords: def2-TZVPP
keywords: def2/J RIJCOSX
keywords: DEFGRID2
keywords: scfconv7
keywords: smallprint printgap noloewdin
keywords: NOSOSCF
formula: C15H22ClNO2
InChI: InChI=1/C15H22ClNO2/c1-5-13-8-6-7-12(4)15(13)17(14(18)9-16)10-19-11(2)3/h6-8,11H,5,9-10H2,1-4H3
41 atoms
Cl 2.315522 1.588793 2.255732
O  -2.204431 0.497038 -1.064183
O  -0.317878 3.144618 0.833284
N  -0.266683 0.966006 0.200856
C  0.482009 -0.170954 -0.226497
C  0.674773 -1.244515 0.647977
C  0.95628 -0.204149 -1.546264
C  -1.720198 0.831114 0.197638
C  0.149793 -1.266225 2.0594
C  1.368069 -2.359143 0.178578
C  -2.600671 -0.864978 -1.25051
C  1.642422 -1.335567 -1.972498
C  0.312765 2.141145 0.547893
C  1.847859 -2.407673 -1.117443
C  0.772435 0.951512 -2.484589
C  -0.984557 -2.271032 2.247582
C  -3.994951 -1.099075 -0.694397
C  -2.526123 -1.157842 -2.734248
C  1.829489 2.169185 0.631229
H  -2.142934 1.786434 0.502321
H  -2.003895 0.085343 0.946139
H  0.97016 -1.532216 2.730395
H  -0.179783 -0.275423 2.370245
H  1.533824 -3.198003 0.844639
H  -1.896467 -1.524947 -0.729406
H  2.016913 -1.376724 -2.988117
H  2.383648 -3.281848 -1.465282
H  1.44988 1.777241 -2.250116
H  0.989551 0.648403 -3.508409
H  -0.238925 1.351406 -2.4623
H  -1.338446 -2.259797 3.2795
H  -0.661162 -3.288416 2.022784
H  -1.837105 -2.048955 1.603946
H  -4.735468 -0.488709 -1.215342
H  -4.278948 -2.145882 -0.812914
H  -4.055369 -0.867073 0.370917
H  -3.201743 -0.515417 -3.30276
H  -2.813532 -2.19247 -2.924416
H  -1.5145 -1.020006 -3.119149
H  2.166587 3.197685 0.533065
H  2.344061 1.55293 -0.099274
elementType: Cl O N C H
totalener: -1250.36737529 hartree
nucrepener: 1726.96987391 hartree
electener: -2977.33724921 hartree
oneelecener: -5141.23307026 hartree
twoeener: 2163.89582105 hartree
cpcmener: -0.02529403 hartree
kineticenergy: 1246.04205798 hartree
xcener: -99.067294776737 hartree
chargesum: -0.0000000
charge: -0.155431 -0.383969 -0.490063 0.010195 0.122613 -0.149235 -0.204677 0.041120 -0.147199 -0.071682 0.188516 -0.063231 0.303927 -0.186780 -0.257413 -0.257147 -0.275134 -0.271449 -0.077812 0.108992 0.132729 0.091473 0.071832 0.141546 0.051203 0.136725 0.155887 0.109535 0.104832 0.108535 0.098933 0.089740 0.070429 0.093661 0.095320 0.088704 0.093600 0.095095 0.090888 0.151479 0.143714
qa: -0.1554 -0.3840 -0.4901 0.0102 0.1226 -0.1492 -0.2047 0.0411 -0.1472 -0.0717 0.1885 -0.0632 0.3039 -0.1868 -0.2574 -0.2571 -0.2751 -0.2714 -0.0778 0.1090 0.1327 0.0915 0.0718 0.1415 0.0512 0.1367 0.1559 0.1095 0.1048 0.1085 0.0989 0.0897 0.0704 0.0937 0.0953 0.0887 0.0936 0.0951 0.0909 0.1515 0.1437
va: 1.1192 1.9227 2.0256 2.9894 3.4228 3.7324 3.8791 3.9203 3.8608 3.8008 3.8192 3.7988 4.1190 3.9678 3.9179 3.9355 3.9319 3.9156 3.9576 1.0457 0.9828 1.0015 1.0197 0.9964 0.9913 1.0021 0.9908 0.9954 1.0019 1.0171 1.0062 1.0046 1.0004 1.0098 1.0070 1.0037 1.0087 1.0069 1.0040 1.0083 1.0088
dispcorr: -0.025436958 hartree
energy: -1250.392812249892
dipole: -19.09000 19.27803 0.18803 -17.59831 15.33895 -2.25935 -12.31570 11.45304 -0.86266
magnitude: 2.42574 au
magnitude: 6.16574 debye
