program: Orca
programVersion: 5.0.2
elementType: Cl O O N C C C C C C C C C C C C C C C H H H H H H H H H H H H H H H H H H H H H H
charge: 0
multiplicity: 1
keywords: wb97x-d3
keywords: def2-TZVPP
keywords: def2/J RIJCOSX
keywords: DEFGRID2
keywords: scfconv7
keywords: smallprint printgap noloewdin
keywords: NOSOSCF
formula: C15H22ClNO2
InChI: InChI=1/C15H22ClNO2/c1-5-13-8-6-7-12(4)15(13)17(14(18)9-16)10-19-11(2)3/h6-8,11H,5,9-10H2,1-4H3
41 atoms
Cl 1.248962 3.037001 0.773972
O  -2.284716 -0.268475 -1.091092
O  -1.247495 1.419298 1.676288
N  -0.384242 -0.213906 0.369308
C  0.752579 -0.921461 -0.133636
C  1.243256 -2.008078 0.597481
C  1.322095 -0.54244 -1.35589
C  -1.703146 -0.766898 0.068455
C  0.655189 -2.44208 1.914258
C  2.34276 -2.701205 0.096302
C  -3.192998 0.83126 -0.983853
C  2.425953 -1.25478 -1.814111
C  -0.280841 0.865698 1.183466
C  2.935535 -2.325272 -1.095628
C  0.774392 0.58825 -2.174473
C  1.460305 -1.942848 3.110844
C  -2.546483 2.125169 -1.449348
C  -4.415068 0.491713 -1.81874
C  1.109915 1.397631 1.484983
H  -2.350671 -0.627772 0.93775
H  -1.563348 -1.837582 -0.082546
H  -0.378977 -2.112788 2.016586
H  0.629652 -3.533733 1.937588
H  2.733251 -3.545569 0.652572
H  -3.502763 0.941773 0.061413
H  2.887906 -0.967789 -2.750932
H  3.793195 -2.869076 -1.470817
H  1.452513 0.830738 -2.99193
H  -0.18859 0.327268 -2.612637
H  0.627813 1.496623 -1.590283
H  1.47506 -0.853607 3.162856
H  2.494478 -2.286834 3.066132
H  1.028061 -2.309983 4.042396
H  -3.253983 2.949745 -1.349479
H  -1.663218 2.384341 -0.866176
H  -2.25551 2.066074 -2.500059
H  -5.145942 1.299794 -1.768745
H  -4.900339 -0.418032 -1.462324
H  -4.149827 0.349214 -2.868587
H  1.93151 0.802657 1.100419
H  1.219471 1.499893 2.563559
elementType: Cl O N C H
totalener: -1250.36802299 hartree
nucrepener: 1698.66541696 hartree
electener: -2949.03343996 hartree
oneelecener: -5085.00153135 hartree
twoeener: 2135.96809139 hartree
cpcmener: -0.02428135 hartree
kineticenergy: 1246.02885439 hartree
xcener: -99.060508277622 hartree
chargesum: -0.0000000
charge: -0.152567 -0.380581 -0.483206 0.036832 0.000320 -0.101099 -0.094696 0.072024 -0.150579 -0.078739 0.186873 -0.073318 0.292464 -0.181531 -0.288992 -0.268365 -0.272203 -0.262922 -0.103868 0.121288 0.122013 0.082954 0.090811 0.141932 0.051312 0.139142 0.155818 0.102352 0.104150 0.084121 0.085155 0.087897 0.097266 0.106567 0.074069 0.088117 0.086375 0.090251 0.085622 0.149515 0.157426
qa: -0.1526 -0.3806 -0.4832 0.0368 0.0003 -0.1011 -0.0947 0.0720 -0.1506 -0.0787 0.1869 -0.0733 0.2925 -0.1815 -0.2890 -0.2684 -0.2722 -0.2629 -0.1039 0.1213 0.1220 0.0830 0.0908 0.1419 0.0513 0.1391 0.1558 0.1024 0.1041 0.0841 0.0852 0.0879 0.0973 0.1066 0.0741 0.0881 0.0864 0.0903 0.0856 0.1495 0.1574
va: 1.1220 1.9485 2.0216 2.9203 3.7207 3.8617 3.8105 3.9751 3.9016 3.8154 3.7978 3.8171 4.1094 3.9552 3.9432 3.9152 3.9162 3.9492 3.9821 1.0000 0.9921 1.0060 1.0012 0.9986 1.0180 1.0014 0.9913 1.0110 1.0103 1.0153 1.0044 1.0028 1.0052 1.0099 1.0131 1.0037 1.0060 1.0086 1.0071 1.0044 1.0046
dispcorr: -0.024290193 hartree
energy: -1250.392313186408
dipole: -10.78542 11.57828 0.79286 -10.98194 9.25233 -1.72960 -4.35985 4.38129 0.02144
magnitude: 1.90279 au
magnitude: 4.83651 debye
