program: Orca
programVersion: 5.0.2
elementType: Cl O O N C C C C C C C C C C C C C C C H H H H H H H H H H H H H H H H H H H H H H
charge: 0
multiplicity: 1
keywords: wb97x-d3
keywords: def2-TZVPP
keywords: def2/J RIJCOSX
keywords: DEFGRID2
keywords: scfconv7
keywords: smallprint printgap noloewdin
keywords: NOSOSCF
formula: C15H22ClNO2
InChI: InChI=1/C15H22ClNO2/c1-5-13-8-6-7-12(4)15(13)17(14(18)9-16)10-19-11(2)3/h6-8,11H,5,9-10H2,1-4H3
41 atoms
Cl 1.938793 1.757171 2.14641
O  -2.448815 -0.366236 -0.923899
O  -1.225565 2.055191 1.103655
N  -0.378681 0.182516 0.155511
C  0.760041 -0.554752 -0.296885
C  1.411863 -1.412722 0.594162
C  1.178634 -0.425946 -1.62917
C  -1.660959 -0.512644 0.213077
C  0.95635 -1.636585 2.012196
C  2.521408 -2.121425 0.135094
C  -3.436029 0.668596 -0.93856
C  2.289149 -1.151395 -2.044779
C  -0.277358 1.444526 0.642346
C  2.961105 -1.990938 -1.168694
C  0.46823 0.472076 -2.597548
C  0.353912 -3.025726 2.214529
C  -3.004476 1.817275 -1.834517
C  -4.739265 0.053475 -1.413968
C  1.089173 2.105271 0.608245
H  -2.192042 -0.202222 1.116761
H  -1.435505 -1.574639 0.302174
H  1.814951 -1.522151 2.677722
H  0.234628 -0.881135 2.320752
H  3.046833 -2.779327 0.817539
H  -3.58035 1.044211 0.080405
H  2.631184 -1.056071 -3.068101
H  3.829134 -2.542751 -1.506627
H  -0.559853 0.151524 -2.762488
H  0.430911 1.508451 -2.255195
H  0.972529 0.468498 -3.563064
H  -0.515013 -3.186478 1.575284
H  0.032548 -3.156698 3.248703
H  1.075936 -3.812576 1.992287
H  -2.062004 2.260181 -1.51396
H  -2.892896 1.490768 -2.87062
H  -3.757169 2.607161 -1.816406
H  -4.640448 -0.357678 -2.420919
H  -5.527002 0.807514 -1.440311
H  -5.069027 -0.746187 -0.74885
H  0.952042 3.182187 0.546223
H  1.730336 1.780354 -0.206144
elementType: Cl O N C H
totalener: -1250.36835149 hartree
nucrepener: 1700.03903179 hartree
electener: -2950.40738328 hartree
oneelecener: -5087.80506648 hartree
twoeener: 2137.39768320 hartree
cpcmener: -0.02354861 hartree
kineticenergy: 1246.03057133 hartree
xcener: -99.060853500091 hartree
chargesum: 0.0000000
charge: -0.152979 -0.386415 -0.482102 0.044368 0.064281 -0.151508 -0.147340 0.086458 -0.159276 -0.080644 0.188409 -0.056604 0.277591 -0.189044 -0.282083 -0.257064 -0.290535 -0.260238 -0.067066 0.121192 0.123726 0.091821 0.075050 0.141139 0.050336 0.138866 0.155774 0.103786 0.094446 0.101713 0.084158 0.094394 0.086058 0.086800 0.089970 0.106912 0.085283 0.085943 0.089888 0.151511 0.143025
qa: -0.1530 -0.3864 -0.4821 0.0444 0.0643 -0.1515 -0.1473 0.0865 -0.1593 -0.0806 0.1884 -0.0566 0.2776 -0.1890 -0.2821 -0.2571 -0.2905 -0.2602 -0.0671 0.1212 0.1237 0.0918 0.0750 0.1411 0.0503 0.1389 0.1558 0.1038 0.0944 0.1017 0.0842 0.0944 0.0861 0.0868 0.0900 0.1069 0.0853 0.0859 0.0899 0.1515 0.1430
va: 1.1220 1.9455 2.0169 2.9397 3.6518 3.7666 3.8254 3.9615 3.8819 3.8169 3.8005 3.7990 4.1353 3.9697 3.9532 3.9297 3.9185 3.9463 3.9626 0.9995 1.0006 1.0028 1.0161 0.9984 1.0192 1.0010 0.9914 1.0117 0.9955 1.0100 1.0040 1.0049 1.0040 1.0070 1.0029 1.0087 1.0075 1.0060 1.0087 1.0070 1.0107
dispcorr: -0.024094727 hartree
energy: -1250.392446213505
dipole: -17.14869 17.65068 0.50199 -9.12692 8.35591 -0.77101 -12.15758 11.22170 -0.93588
magnitude: 1.31237 au
magnitude: 3.33577 debye
