program: Orca
programVersion: 5.0.2
elementType: Cl O O N C C C C C C C C C C C C C C C H H H H H H H H H H H H H H H H H H H H H H
charge: 0
multiplicity: 1
keywords: wb97x-d3
keywords: def2-TZVPP
keywords: def2/J RIJCOSX
keywords: DEFGRID2
keywords: scfconv7
keywords: smallprint printgap noloewdin
keywords: NOSOSCF
formula: C15H22ClNO2
InChI: InChI=1/C15H22ClNO2/c1-5-13-8-6-7-12(4)15(13)17(14(18)9-16)10-19-11(2)3/h6-8,11H,5,9-10H2,1-4H3
41 atoms
Cl 0.18462 3.163756 -1.375121
O  -2.167474 0.077981 0.474692
O  1.677707 1.483914 1.192474
N  0.126004 0.19851 0.178331
C  0.918277 -0.973281 0.392734
C  1.739239 -1.409004 -0.654449
C  0.859447 -1.635893 1.619005
C  -1.144429 0.058714 -0.484217
C  1.799123 -0.623763 -1.942339
C  2.488997 -2.563898 -0.45698
C  -3.48064 -0.069275 -0.057427
C  1.62369 -2.790282 1.773896
C  0.61634 1.389257 0.60566
C  2.426942 -3.25169 0.745919
C  0.036675 -1.121511 2.761762
C  2.812699 -1.11223 -2.964007
C  -4.377501 -0.477202 1.094682
C  -3.968959 1.210806 -0.71894
C  -0.193567 2.634536 0.297703
H  -1.1379 -0.892276 -1.02682
H  -1.271999 0.850034 -1.227981
H  0.808517 -0.616271 -2.407483
H  2.016862 0.422164 -1.70953
H  3.134645 -2.934681 -1.241896
H  -3.476781 -0.875739 -0.80447
H  1.587713 -3.326982 2.71421
H  3.014977 -4.150613 0.881847
H  -0.026858 -1.864767 3.555555
H  0.483564 -0.22397 3.195064
H  -0.977261 -0.864186 2.46279
H  2.600034 -2.125088 -3.30817
H  3.829582 -1.097194 -2.569038
H  2.794637 -0.462582 -3.839336
H  -4.401101 0.294008 1.867659
H  -5.398521 -0.626942 0.743207
H  -4.042763 -1.409691 1.551294
H  -4.975776 1.064722 -1.112741
H  -3.342582 1.520453 -1.557002
H  -4.008737 2.032066 -0.000172
H  0.116209 3.429584 0.970841
H  -1.268879 2.501264 0.380899
elementType: Cl O N C H
totalener: -1250.37017402 hartree
nucrepener: 1674.84630999 hartree
electener: -2925.21648401 hartree
oneelecener: -5037.55721481 hartree
twoeener: 2112.34073080 hartree
cpcmener: -0.02628472 hartree
kineticenergy: 1246.04016953 hartree
xcener: -99.062749907798 hartree
chargesum: -0.0000000
charge: -0.153135 -0.360033 -0.475428 -0.036320 0.166852 -0.135718 -0.172126 0.048453 -0.063255 -0.101233 0.146952 -0.080854 0.274740 -0.187950 -0.271675 -0.302384 -0.268366 -0.274652 -0.072415 0.125715 0.121891 0.083988 0.076019 0.144173 0.053137 0.136385 0.154713 0.098803 0.103030 0.103326 0.087136 0.092452 0.097300 0.088271 0.093694 0.093981 0.104744 0.090338 0.087563 0.150851 0.131035
qa: -0.1531 -0.3600 -0.4754 -0.0363 0.1669 -0.1357 -0.1721 0.0485 -0.0633 -0.1012 0.1470 -0.0809 0.2747 -0.1879 -0.2717 -0.3024 -0.2684 -0.2747 -0.0724 0.1257 0.1219 0.0840 0.0760 0.1442 0.0531 0.1364 0.1547 0.0988 0.1030 0.1033 0.0871 0.0925 0.0973 0.0883 0.0937 0.0940 0.1047 0.0903 0.0876 0.1509 0.1310
va: 1.1224 1.9271 2.0213 3.0002 3.5921 3.9399 3.9520 3.9520 3.8745 3.8124 3.9039 3.8243 4.1548 3.9833 3.9089 3.9738 3.9182 3.8745 3.9327 0.9949 0.9863 0.9954 1.0076 0.9995 1.0022 1.0023 0.9927 1.0056 1.0015 1.0176 0.9962 0.9971 1.0035 1.0077 1.0072 1.0073 1.0100 1.0093 1.0069 1.0124 1.0202
dispcorr: -0.021996265 hartree
energy: -1250.392170282526
dipole: -14.17407 11.99065 -2.18341 -13.10724 12.27638 -0.83086 -0.59930 -0.30529 -0.90459
magnitude: 2.50518 au
magnitude: 6.36766 debye
