program: Gaussian 09
title: 000006418
version: EM64L-G09RevD.01
frameworkgroup: C1[X(C3H4Cl2O2)]
method: RPBEPBE
basis: SDD
operation: Freq
keyword: #p
keyword: freq=noraman
keyword: PBEPBE/SDD
title: #p freq=noraman PBEPBE/SDD
converged: YES YES NO NO
title: Mulliken charges:
elementType: Cl Cl O O C C C H H H H
charge: 0.066244 0.037857 -0.405062 -0.176389 -0.424763 -0.571535 0.314905 0.238926 0.260285 0.264347 0.395185
chargesum: 0.00000
title: Mulliken charges with hydrogens summed into heavy atoms:
elementType: Cl Cl O O C C C
charge: 0.066244 0.037857 -0.009877 -0.176389 -0.424763 0.192023 0.314905
polarizability: 5.78560278e+01 4.68242768e+00 6.27879882e+01 2.30209775e+00 5.82697836e-01 4.99448642e+01
1716.lowfreq: -13.5395 -5.9512 -0.0024 -0.0016 0.0023 5.7275 42.8611 171.5288 205.0532
frequency: 42.8241 171.5281 205.0531 258.4513 276.5625 309.1194 316.6175 389.8725 478.0140 555.9649 599.6097 640.3913 723.2221 817.7271 1018.0074 1069.6137 1096.0287 1152.9904 1297.8677 1399.6183 1454.0552 1456.4977 1674.8891 3010.1847 3111.4023 3133.9739 3527.2385
redmass: 11.0812 9.0311 7.7705 4.7378 1.3566 2.9116 3.2534 10.1477 5.7092 2.0846 2.5967 2.6694 6.6573 3.4096 2.5375 1.7493 3.3187 1.9837 2.3017 1.1948 1.0432 1.0512 10.4597 1.0360 1.0987 1.1016 1.0644
irintensity: 0.9085 1.2840 0.2354 0.1229 0.4945 2.3944 2.7670 0.1481 6.7269 42.0290 96.1462 199.5346 12.2535 8.1085 272.7085 57.4507 13.7165 17.8545 14.1310 22.1545 9.2103 15.5313 196.9180 2.7646 6.2389 3.6243 42.4169
temp: 298.150 k
press: 1.00000 atm
elementType: 17 17 8 8 6 6 6 1 1 1 1
symmnumber: 1
zpe: 180560.3 jmol-1
zpe.correction: 0.068772 hartree
zpe.thermalcorrener: 0.076711 hartree
zpe.thermalcorrenthalpy: 0.077655 hartree
zpe.thermalcorrgfe: 0.035332 hartree
zpe.sumelectzpe: -1186.731215 hartree
zpe.sumelectthermal: -1186.723275 hartree
zpe.sumelectthermalent: -1186.722331 hartree
zpe.sumelectthermalfe: -1186.764654 hartree
dipole: 1.8307 0.9536 2.6113
dipole: 3.3286
quadrupole: -47.6211 -58.7978 -54.0129
quadrupole: -0.1161 -0.3049 -2.0156
quadrupole: 5.8562 -5.3205 -0.5356 -0.1161 -0.3049 -2.0156
hfenergy: -1186.7999864 hartree
pointgroup: C01 [X(C3H4Cl2O2)]
dipole: 0.4035711 0.8485638 0.9121684 debye
dipolederiv: -0.1855131 -0.2041215 0.021811 -0.1470281 -0.5851775 0.0427657 -0.0069238 -0.0015307 -0.15989 -0.2470095 0.107035 -0.1119398 0.0604109 -0.3471225 0.2216611 -0.0657811 0.2605141 -0.498358 -0.62757 -0.4625121 -0.2306194 -0.3469308 -0.8510396 -0.2171129 -0.1492259 -0.1518393 -0.4485288 -0.6756387 0.2587527 0.1225608 0.039902 -0.7108935 -0.1939944 0.0658463 -0.2382919 -0.3565025 0.2321962 0.1195726 0.0322646 0.2456024 1.0750399 -0.2804151 0.0865155 -0.2683464 0.8523552 -0.0948663 -0.0065692 0.0100443 -0.0153494 -0.1528527 -0.0511572 0.0314989 -0.0498537 -0.1918002 1.2695562 0.1087356 0.0821927 0.0752305 1.1174502 0.5080611 0.0130455 0.4697361 0.2871719 0.1034843 0.0463691 -0.0369079 0.0392694 0.0462414 0.0579104 -0.0500078 0.0627469 -0.0350578 -0.0748683 0.0234225 0.0230217 0.0190471 0.1187761 -0.016851 0.0056885 -0.0102391 0.1002833 0.1140426 -0.0577912 0.0133979 -0.0704941 -0.0207179 -0.0136027 -0.0136632 -0.0179702 0.0910927 0.1861866 0.0671065 0.0741742 0.1003401 0.3102961 -0.057265 0.083007 -0.0549259 0.3592342 unknown
polarizability: 54.787897|2.3232415|65.1321903|2.103945|-2.0468266|50.6687929 unknown
InChI: InChI=1S/C3H4Cl2O2/c1-3(4,5)2(6)7/h6H,1H3
charge 0 multiplicity 1
11 atoms
Cl -1.355261 -1.677115 0.096686
Cl -1.177139 0.998661 -1.366515
O  1.605434 1.005992 0.357387
O  1.541459 -1.115176 -0.593537
C  -0.566267 0.010921 0.14035
C  -0.976175 0.743202 1.410326
C  0.952179 -0.147149 -0.087229
H  -0.634423 0.178343 2.295584
H  -2.072918 0.835316 1.450202
H  -0.520515 1.745467 1.429249
H  2.576725 0.931839 0.153696
