program: Orca
programVersion: 5.0.2
elementType: Cl O O N C C C C C C C C C C C C C C C H H H H H H H H H H H H H H H H H H H H H H
charge: 0
multiplicity: 1
keywords: wb97x-d3
keywords: def2-TZVPP
keywords: def2/J RIJCOSX
keywords: DEFGRID2
keywords: scfconv7
keywords: smallprint printgap noloewdin
keywords: NOSOSCF
formula: C15H22ClNO2
InChI: InChI=1/C15H22ClNO2/c1-5-13-8-6-7-12(4)15(13)17(14(18)9-16)10-19-11(2)3/h6-8,11H,5,9-10H2,1-4H3
41 atoms
Cl 2.133495 2.903761 0.221742
O  -2.108212 0.348514 -0.941304
O  -0.865883 2.373763 1.356867
N  -0.318888 0.336914 0.534866
C  0.680567 -0.576998 0.079486
C  1.080081 -1.616955 0.93084
C  1.223997 -0.430504 -1.202324
C  -1.699441 -0.029549 0.342188
C  0.510573 -1.807397 2.312229
C  2.042846 -2.511404 0.476462
C  -3.332646 -0.233659 -1.370719
C  2.185856 -1.350679 -1.615412
C  -0.021655 1.535781 1.100238
C  2.592631 -2.382024 -0.78827
C  0.813316 0.643897 -2.167222
C  -0.437787 -3.001229 2.396007
C  -4.531297 0.404306 -0.686327
C  -3.39503 -0.076685 -2.87694
C  1.432707 1.800081 1.444965
H  -2.300285 0.441796 1.124303
H  -1.781867 -1.115007 0.465967
H  1.336772 -1.964202 3.010029
H  -0.006443 -0.909326 2.651083
H  2.371361 -3.313678 1.127007
H  -3.320234 -1.307068 -1.13037
H  2.620876 -1.249451 -2.602757
H  3.344758 -3.083312 -1.126993
H  1.687416 1.041978 -2.681988
H  0.152687 0.233833 -2.933459
H  0.293794 1.478381 -1.707373
H  0.065943 -3.930683 2.126932
H  -1.292946 -2.884274 1.729368
H  -0.822189 -3.11601 3.410362
H  -4.514119 0.267207 0.396112
H  -4.576205 1.475592 -0.892709
H  -5.455035 -0.046866 -1.051394
H  -3.405337 0.97602 -3.166985
H  -4.303173 -0.537995 -3.265535
H  -2.545435 -0.558537 -3.363514
H  2.059028 0.914699 1.493222
H  1.467418 2.311371 2.404743
elementType: Cl O N C H
totalener: -1250.36870666 hartree
nucrepener: 1683.98962014 hartree
electener: -2934.35832680 hartree
oneelecener: -5055.87492125 hartree
twoeener: 2121.51659445 hartree
cpcmener: -0.02831818 hartree
kineticenergy: 1246.04462150 hartree
xcener: -99.062801883242 hartree
chargesum: 0.0000000
charge: -0.153927 -0.360969 -0.485475 -0.027696 0.115500 -0.127035 -0.150543 0.093891 -0.169695 -0.061523 0.160659 -0.082774 0.296309 -0.188990 -0.300782 -0.257369 -0.267818 -0.270951 -0.073257 0.106722 0.125905 0.094068 0.083988 0.140879 0.047259 0.138711 0.154975 0.112396 0.115174 0.083621 0.086150 0.084172 0.095463 0.093546 0.086827 0.092431 0.090358 0.092639 0.090887 0.141575 0.154701
qa: -0.1539 -0.3610 -0.4855 -0.0277 0.1155 -0.1270 -0.1505 0.0939 -0.1697 -0.0615 0.1607 -0.0828 0.2963 -0.1890 -0.3008 -0.2574 -0.2678 -0.2710 -0.0733 0.1067 0.1259 0.0941 0.0840 0.1409 0.0473 0.1387 0.1550 0.1124 0.1152 0.0836 0.0861 0.0842 0.0955 0.0935 0.0868 0.0924 0.0904 0.0926 0.0909 0.1416 0.1547
va: 1.1166 1.9575 2.0280 3.0008 3.5848 3.8205 3.8527 3.9498 3.8822 3.7907 3.8916 3.8339 4.1259 3.9580 3.9385 3.9135 3.8900 3.9267 3.9787 1.0025 0.9786 1.0009 1.0151 0.9981 1.0032 0.9976 0.9916 0.9988 0.9946 1.0212 1.0037 1.0042 1.0045 1.0061 1.0096 1.0092 1.0071 1.0077 1.0062 1.0119 1.0039
dispcorr: -0.022644308 hartree
energy: -1250.391350965726
dipole: -20.27042 20.34046 0.07003 -19.20927 16.51484 -2.69443 -3.92199 4.23542 0.31343
magnitude: 2.71350 au
magnitude: 6.89718 debye
