program: Orca
programVersion: 5.0.2
elementType: Cl O O N C C C C C C C C C C C C C C C H H H H H H H H H H H H H H H H H H H H H H
charge: 0
multiplicity: 1
keywords: wb97x-d3
keywords: def2-TZVPP
keywords: def2/J RIJCOSX
keywords: DEFGRID2
keywords: scfconv7
keywords: smallprint printgap noloewdin
keywords: NOSOSCF
formula: C15H22ClNO2
InChI: InChI=1/C15H22ClNO2/c1-5-13-8-6-7-12(4)15(13)17(14(18)9-16)10-19-11(2)3/h6-8,11H,5,9-10H2,1-4H3
41 atoms
Cl 1.315633 1.453339 2.588401
O  -2.291442 0.010057 -0.202517
O  -0.825335 2.599194 0.258118
N  -0.059971 0.588622 -0.426375
C  1.003205 -0.360275 -0.529025
C  1.106484 -1.412465 0.382048
C  1.908598 -0.211385 -1.589962
C  -1.294502 0.331575 -1.129887
C  0.103571 -1.663812 1.474391
C  2.170821 -2.3030 0.232263
C  -3.593598 -0.116784 -0.764896
C  2.949276 -1.122874 -1.707176
C  0.071549 1.776953 0.215963
C  3.084699 -2.160424 -0.795116
C  1.762812 0.911711 -2.572804
C  -0.811949 -2.838736 1.139204
C  -4.414755 -0.94586 0.201904
C  -4.228262 1.243374 -1.014062
C  1.39306 2.061182 0.905336
H  -1.118236 -0.497069 -1.823851
H  -1.563199 1.210816 -1.724764
H  0.637974 -1.882185 2.401488
H  -0.496837 -0.777898 1.668756
H  2.277942 -3.119635 0.936757
H  -3.525143 -0.657962 -1.719597
H  3.660432 -1.018557 -2.517504
H  3.905265 -2.860031 -0.891727
H  2.552033 0.873167 -3.322442
H  0.80797 0.869142 -3.100583
H  1.818442 1.891657 -2.09334
H  -1.546387 -2.991821 1.931133
H  -0.248153 -3.76615 1.028462
H  -1.355176 -2.671856 0.208761
H  -3.969407 -1.928625 0.364123
H  -4.507525 -0.448105 1.169457
H  -5.420042 -1.098276 -0.191711
H  -3.660922 1.848435 -1.722644
H  -4.321948 1.807757 -0.084226
H  -5.228181 1.117759 -1.431719
H  1.535678 3.13807 0.951535
H  2.257217 1.606029 0.429979
elementType: Cl O N C H
totalener: -1250.37012660 hartree
nucrepener: 1697.41281522 hartree
electener: -2947.78294182 hartree
oneelecener: -5083.07850723 hartree
twoeener: 2135.29556541 hartree
cpcmener: -0.02883284 hartree
kineticenergy: 1246.04461680 hartree
xcener: -99.061986882744 hartree
chargesum: -0.0000000
charge: -0.152358 -0.364007 -0.482050 0.006783 0.084017 -0.153013 -0.158601 0.063668 -0.143586 -0.079910 0.150266 -0.050766 0.288385 -0.187684 -0.260055 -0.287122 -0.262334 -0.268891 -0.066657 0.130180 0.130164 0.092610 0.061514 0.141873 0.049622 0.139772 0.155954 0.102077 0.109016 0.101083 0.100555 0.094553 0.076585 0.091623 0.089847 0.091894 0.089161 0.086360 0.095114 0.151519 0.142837
qa: -0.1524 -0.3640 -0.4820 0.0068 0.0840 -0.1530 -0.1586 0.0637 -0.1436 -0.0799 0.1503 -0.0508 0.2884 -0.1877 -0.2601 -0.2871 -0.2623 -0.2689 -0.0667 0.1302 0.1302 0.0926 0.0615 0.1419 0.0496 0.1398 0.1560 0.1021 0.1090 0.1011 0.1006 0.0946 0.0766 0.0916 0.0898 0.0919 0.0892 0.0864 0.0951 0.1515 0.1428
va: 1.1205 1.9278 2.0265 2.9569 3.5897 3.7941 3.8991 3.9239 3.8349 3.8091 3.8925 3.7895 4.1376 3.9665 3.9642 3.9321 3.9231 3.9058 3.9582 0.9886 0.9822 1.0036 1.0433 0.9977 1.0005 1.0010 0.9912 1.0053 0.9954 0.9949 1.0006 1.0076 1.0071 1.0047 1.0072 1.0084 1.0100 1.0102 1.0091 1.0069 1.0077
dispcorr: -0.023389409 hartree
energy: -1250.393516012173
dipole: -17.74997 18.54488 0.79491 -11.38613 10.13916 -1.24697 -13.12780 11.21897 -1.90883
magnitude: 2.41463 au
magnitude: 6.13750 debye
