program: Orca
programVersion: 5.0.2
elementType: Cl O O N C C C C C C C C C C C C C C C H H H H H H H H H H H H H H H H H H H H H H
charge: 0
multiplicity: 1
keywords: wb97x-d3
keywords: def2-TZVPP
keywords: def2/J RIJCOSX
keywords: DEFGRID2
keywords: scfconv7
keywords: smallprint printgap noloewdin
keywords: NOSOSCF
formula: C15H22ClNO2
InChI: InChI=1/C15H22ClNO2/c1-5-13-8-6-7-12(4)15(13)17(14(18)9-16)10-19-11(2)3/h6-8,11H,5,9-10H2,1-4H3
41 atoms
Cl 1.344216 2.87681 2.232413
O  -2.236623 -0.434782 -1.197252
O  -0.777198 2.366627 0.362947
N  -0.089621 0.401048 -0.53146
C  0.90769 -0.621214 -0.597976
C  0.821081 -1.734402 0.250906
C  1.933194 -0.488653 -1.539405
C  -1.150607 0.371297 -1.528879
C  -0.305881 -1.85961 1.245889
C  1.801232 -2.715069 0.137487
C  -3.154584 0.058851 -0.220735
C  2.890217 -1.496654 -1.622673
C  0.041331 1.472845 0.296824
C  2.824095 -2.599758 -0.79204
C  2.017028 0.687475 -2.467162
C  -0.186897 -3.004807 2.237515
C  -3.938625 1.261347 -0.721927
C  -4.078821 -1.095278 0.113911
C  1.315676 1.484655 1.130105
H  -0.733728 -0.059782 -2.439032
H  -1.439558 1.399953 -1.751868
H  -0.408767 -0.925133 1.803651
H  -1.241165 -1.968796 0.693568
H  1.772372 -3.586822 0.777038
H  -2.610751 0.341015 0.689093
H  3.693933 -1.407904 -2.343662
H  3.575543 -3.376008 -0.862726
H  3.047519 0.858888 -2.777202
H  1.435321 0.511992 -3.37564
H  1.647098 1.611882 -2.024999
H  -1.030876 -2.979967 2.927408
H  0.724153 -2.939539 2.834165
H  -0.200796 -3.979759 1.748648
H  -4.502363 1.016546 -1.624629
H  -4.65018 1.578236 0.041744
H  -3.305529 2.122098 -0.937343
H  -4.795469 -0.79191 0.877536
H  -3.5284 -1.954224 0.500982
H  -4.643313 -1.418972 -0.763278
H  2.190184 1.550593 0.482295
H  1.415656 0.581298 1.729703
elementType: Cl O N C H
totalener: -1250.37150145 hartree
nucrepener: 1682.80528934 hartree
electener: -2933.17679079 hartree
oneelecener: -5052.94254443 hartree
twoeener: 2119.76575364 hartree
cpcmener: -0.02625033 hartree
kineticenergy: 1246.02892838 hartree
xcener: -99.066390339260 hartree
chargesum: 0.0000000
charge: -0.150131 -0.376855 -0.470521 -0.004783 0.076359 -0.164598 -0.161940 0.084565 -0.090571 -0.090027 0.145583 -0.070544 0.289712 -0.191290 -0.280835 -0.292635 -0.264073 -0.264820 -0.076861 0.123222 0.122822 0.080217 0.081207 0.144077 0.060812 0.137721 0.155404 0.107974 0.111980 0.105268 0.097768 0.092594 0.086904 0.087759 0.094116 0.090175 0.089302 0.097329 0.089793 0.149136 0.148685
qa: -0.1501 -0.3769 -0.4705 -0.0048 0.0764 -0.1646 -0.1619 0.0846 -0.0906 -0.0900 0.1456 -0.0705 0.2897 -0.1913 -0.2808 -0.2926 -0.2641 -0.2648 -0.0769 0.1232 0.1228 0.0802 0.0812 0.1441 0.0608 0.1377 0.1554 0.1080 0.1120 0.1053 0.0978 0.0926 0.0869 0.0878 0.0941 0.0902 0.0893 0.0973 0.0898 0.1491 0.1487
va: 1.1270 1.9476 2.0289 2.9319 3.6682 3.8613 3.8790 3.9396 3.8729 3.7825 3.8193 3.8229 4.1231 3.9919 3.9347 3.9608 3.9066 3.9246 4.0045 0.9942 0.9948 0.9987 1.0202 0.9995 1.0007 1.0003 0.9926 1.0008 0.9933 0.9994 1.0036 0.9991 0.9958 1.0102 1.0071 1.0159 1.0062 1.0017 1.0086 1.0022 1.0029
dispcorr: -0.022961007 hartree
energy: -1250.394462461364
dipole: -14.96189 15.84242 0.88053 -16.86955 15.23060 -1.63895 -6.94938 6.21175 -0.73763
magnitude: 2.00140 au
magnitude: 5.08715 debye
