program: Gaussian 09
title: 000056245
version: EM64L-G09RevD.01
frameworkgroup: C1[X(C15H18N2O3)]
method: RPBEPBE
basis: SDD
operation: Freq
keyword: #p
keyword: freq=noraman
keyword: PBEPBE/SDD
title: #p freq=noraman PBEPBE/SDD
converged: YES YES NO NO
title: Mulliken charges:
elementType: O O O N N C C C C C C C C C C C C C C C H H H H H H H H H H H H H H H H H H
charge: -0.306381 -0.299561 -0.258607 -0.474385 -0.671958 0.151162 0.040465 0.084523 0.273568 0.409777 -0.562158 -0.758109 -0.434032 0.091989 0.212379 0.167591 -0.354352 -0.811145 -0.531168 -0.529620 0.318749 0.247957 0.191952 0.261677 0.264116 0.246914 0.318159 0.328496 0.248214 0.221611 0.237205 0.263184 0.256052 0.222817 0.229318 0.251502 0.222771 0.229329
chargesum: 0.00000
title: Mulliken charges with hydrogens summed into heavy atoms:
elementType: O O O N N C C C C C C C C C C C C C C C
charge: -0.306381 -0.299561 -0.258607 -0.155636 -0.025303 0.151162 0.040465 0.084523 0.273568 0.409777 -0.314201 -0.040365 -0.187117 0.091989 0.212379 0.167591 -0.106137 -0.089145 0.177019 0.173982
polarizability: 3.46666861e+02 -3.83808504e+00 1.88676647e+02 -3.32716646e+00 -8.13496740e-01 1.11150265e+02
1716.lowfreq: -8.2195 -0.0007 -0.0002 0.0003 1.9437 3.9153 33.2761 40.5400 60.1339
frequency: 33.2125 40.5131 60.1105 64.2071 78.5509 110.0705 117.8303 123.8981 132.4034 156.1512 161.5667 171.6115 199.7010 207.6553 219.5792 234.5591 247.6531 272.3753 278.8033 307.0369 344.8682 348.4860 361.0709 362.2874 402.5600 422.5466 438.6380 454.8733 489.5089 553.4123 558.1307 566.4514 590.2246 607.0921 609.9865 638.5303 669.2513 689.0219 709.3922 720.7698 740.6242 775.6455 839.8362 855.7808 883.9527 930.4620 942.9820 956.3880 967.8402 988.5797 1020.5171 1033.9190 1037.7473 1058.4463 1086.9107 1094.9493 1112.9666 1114.8929 1150.0738 1152.8417 1166.9983 1201.5916 1218.9590 1251.8523 1273.1289 1294.8095 1340.7500 1356.2310 1364.0933 1397.0645 1411.1210 1421.8873 1437.5900 1437.7626 1446.2622 1455.3807 1456.5462 1457.6416 1464.3216 1472.5974 1477.5550 1488.5130 1489.6787 1507.4909 1522.1943 1554.0200 1557.8814 1594.5917 1612.6160 1638.5358 2961.8557 2970.3145 2973.1659 2982.3194 3051.8738 3066.3430 3070.1529 3076.0639 3080.2662 3115.0781 3119.3108 3121.8311 3135.2345 3138.5289 3160.3570 3549.6717 3580.8241 3694.1557
redmass: 4.1125 4.6190 4.4971 3.2128 3.8428 2.7892 1.2447 2.4700 3.0957 1.1402 1.4427 1.9834 3.5949 3.2182 1.4845 3.6629 4.6754 3.7032 3.5569 3.4665 3.7479 3.6825 2.6994 1.7535 3.4340 1.3854 4.0257 5.2070 3.7127 3.5758 3.5940 5.5345 4.3770 1.3570 2.7968 4.5200 4.8908 4.1681 5.7163 5.7394 3.2682 6.1396 1.4766 4.2960 1.5963 2.2485 8.6543 1.5234 3.8259 1.5361 1.6813 2.1577 1.5230 2.7905 2.1636 2.9280 1.2396 1.2431 1.3714 1.3170 2.0398 2.5031 2.4287 1.4710 2.5192 2.9569 5.5561 1.3070 3.9322 3.1594 1.2496 1.2016 1.0583 1.2812 1.6611 1.4005 1.0567 1.1673 1.8347 1.0535 1.0564 1.0544 2.1732 5.4334 4.5433 6.8055 5.5521 4.9961 6.6536 1.2294 1.0387 1.0307 1.0311 1.0374 1.0971 1.1039 1.1037 1.0969 1.0990 1.0972 1.1026 1.1029 1.0881 1.0906 1.0963 1.0463 1.0803 1.1010
irintensity: 0.2282 0.3914 0.7274 3.0369 7.7141 7.2018 1.3739 3.5797 4.5133 0.4001 5.1945 6.9140 5.6088 5.4275 19.2150 7.2345 4.0712 3.3275 1.8952 1.3606 12.4262 16.5868 12.2049 26.5461 29.5325 131.8665 24.3386 4.1945 4.9623 12.9748 3.6667 9.5643 16.9147 66.2893 23.0920 14.7141 0.0825 7.3147 10.5343 7.8911 5.5102 4.4234 34.5033 9.6933 30.1510 56.0834 86.4584 18.0048 43.1375 4.2043 1.0136 3.5464 10.7089 21.9557 18.9021 47.1582 18.7458 4.6604 4.0636 0.9581 23.3233 12.7126 225.4749 16.5556 39.9106 16.8911 61.2418 37.9608 20.1056 5.9772 18.3096 7.9041 15.2536 3.6397 3.6806 231.7811 25.9782 63.3146 66.9246 17.3346 6.4780 20.4793 83.2517 45.0407 6.5877 13.8250 458.2937 138.7017 123.2612 177.1647 8.0563 92.0564 74.5285 34.8131 15.8769 30.3627 24.3729 7.4900 18.9936 17.9486 30.2913 24.3004 5.7473 10.0498 7.2682 20.0889 45.1751 55.9751
temp: 298.150 k
press: 1.00000 atm
elementType: 8 8 8 7 7 6 6 6 6 6 6 6 6 6 6 6 6 6 6 6 1 1 1 1 1 1 1 1 1 1 1 1 1 1 1 1 1 1
symmnumber: 1
zpe: 796216.2 jmol-1
zpe.correction: 0.303263 hartree
zpe.thermalcorrener: 0.324308 hartree
zpe.thermalcorrenthalpy: 0.325253 hartree
zpe.thermalcorrgfe: 0.253620 hartree
zpe.sumelectzpe: -916.073668 hartree
zpe.sumelectthermal: -916.052622 hartree
zpe.sumelectthermalent: -916.051678 hartree
zpe.sumelectthermalfe: -916.123310 hartree
dipole: 3.7906 -0.7158 0.4674
dipole: 3.8858
quadrupole: -132.8611 -106.0061 -114.7687
quadrupole: 11.9877 -2.9221 -2.3953
quadrupole: -14.9825 11.8725 3.1099 11.9877 -2.9221 -2.3953
hfenergy: -916.3769304 hartree
pointgroup: C01 [X(C15H18N2O3)]
dipole: -1.4965614 0.2775242 -0.1430291 debye
polarizability: 346.7998|0.4113714|122.387013|-0.9387141|-27.3455243|177.3069604 unknown
InChI: InChI=1S/C15H18N2O3/c1-8-13(9(2)18)14(16)15(17-8)10-5-6-11(19-3)12(7-10)20-4/h5-7,17H,16H2,1-4H3
charge 0 multiplicity 1
38 atoms
O  -3.663386 -0.087289 1.825732
O  -4.780535 0.297193 -0.863874
O  5.569085 -0.151673 0.369847
N  1.44222 -0.853113 1.018035
N  1.893273 1.366148 -1.798817
C  0.893999 -0.092461 -0.04452
C  3.216721 0.03888 -0.051912
C  1.994566 0.486553 -0.719372
C  2.814392 -0.804453 1.028448
C  -0.54845 0.026721 -0.246298
C  -1.45005 -0.063521 0.856085
C  3.630932 -1.566324 2.028264
C  -1.109603 0.232868 -1.543825
C  4.624568 0.318626 -0.350776
C  -2.842988 0.029229 0.678174
C  -3.387377 0.201456 -0.628671
C  -2.504456 0.320797 -1.723048
C  4.98208 1.191836 -1.559097
C  -4.493621 1.105416 2.118197
C  -5.540485 -0.934469 -0.543531
H  0.882674 -1.441005 1.635238
H  -1.083604 -0.150345 1.885311
H  2.982452 -2.136197 2.720092
H  4.323389 -2.263067 1.524477
H  4.273469 -0.885392 2.612692
H  -0.457824 0.241205 -2.42405
H  0.981395 1.752907 -2.032096
H  2.711215 1.87078 -2.12334
H  -2.937346 0.449064 -2.720658
H  4.643315 2.236352 -1.404275
H  4.526468 0.803265 -2.48982
H  6.07709 1.201469 -1.673069
H  -5.14413 1.355576 1.261206
H  -3.843852 1.968073 2.359265
H  -5.096707 0.832957 2.997648
H  -5.400385 -1.221817 0.514425
H  -5.216344 -1.762705 -1.201985
H  -6.595061 -0.68864 -0.741201
