program: Orca
programVersion: 5.0.2
elementType: Cl O O N C C C C C C C C C C C C C C C H H H H H H H H H H H H H H H H H H H H H H
charge: 0
multiplicity: 1
keywords: wb97x-d3
keywords: def2-TZVPP
keywords: def2/J RIJCOSX
keywords: DEFGRID2
keywords: scfconv7
keywords: smallprint printgap noloewdin
keywords: NOSOSCF
formula: C15H22ClNO2
InChI: InChI=1/C15H22ClNO2/c1-5-13-8-6-7-12(4)15(13)17(14(18)9-16)10-19-11(2)3/h6-8,11H,5,9-10H2,1-4H3
41 atoms
Cl 1.312315 2.898876 2.208941
O  -2.186116 -0.466694 -1.256358
O  -0.796207 2.398895 0.309239
N  -0.080673 0.447265 -0.593361
C  0.894918 -0.595136 -0.641092
C  0.768895 -1.726333 0.171012
C  1.941466 -0.466956 -1.566982
C  -1.1431 0.394998 -1.586408
C  -0.319229 -1.883164 1.201907
C  1.705818 -2.748331 0.016551
C  -3.145785 -0.001956 -0.30564
C  2.858166 -1.503734 -1.680258
C  0.016969 1.49868 0.262532
C  2.735279 -2.643546 -0.900095
C  2.077839 0.754623 -2.426721
C  0.21076 -2.178498 2.601831
C  -3.993933 1.134377 -0.854327
C  -3.997756 -1.201563 0.058364
C  1.242515 1.465951 1.163215
H  -0.714715 0.000334 -2.507775
H  -1.478531 1.413826 -1.785833
H  -0.937292 -0.98834 1.245858
H  -0.984327 -2.694403 0.892887
H  1.621908 -3.642684 0.621881
H  -2.633977 0.344731 0.600638
H  3.673091 -1.418402 -2.388759
H  3.449885 -3.450036 -1.004861
H  1.334335 0.771103 -3.227029
H  1.957694 1.679944 -1.862167
H  3.058393 0.782903 -2.900183
H  0.752329 -3.123303 2.650662
H  -0.614807 -2.241162 3.311924
H  0.883795 -1.392655 2.948698
H  -3.411324 2.028489 -1.078103
H  -4.519526 0.831592 -1.762277
H  -4.741638 1.423994 -0.114788
H  -3.393583 -2.015724 0.461505
H  -4.54422 -1.578551 -0.808847
H  -4.72886 -0.925133 0.818397
H  2.15837 1.433952 0.573481
H  1.230159 0.585678 1.804561
elementType: Cl O N C H
totalener: -1250.37178806 hartree
nucrepener: 1688.17122493 hartree
electener: -2938.54301299 hartree
oneelecener: -5063.65008363 hartree
twoeener: 2125.10707065 hartree
cpcmener: -0.02760793 hartree
kineticenergy: 1246.03550005 hartree
xcener: -99.066285149147 hartree
chargesum: -0.0000000
charge: -0.150016 -0.373242 -0.471832 -0.009162 0.116015 -0.149490 -0.180044 0.084614 -0.202708 -0.086174 0.139760 -0.060694 0.289985 -0.188152 -0.262900 -0.254619 -0.267301 -0.262659 -0.072392 0.124868 0.124164 0.089274 0.098780 0.143411 0.062042 0.138770 0.155395 0.106112 0.103933 0.103580 0.088332 0.094399 0.084210 0.090826 0.088761 0.093637 0.094920 0.089896 0.088640 0.147844 0.149216
qa: -0.1500 -0.3732 -0.4718 -0.0092 0.1160 -0.1495 -0.1800 0.0846 -0.2027 -0.0862 0.1398 -0.0607 0.2900 -0.1882 -0.2629 -0.2546 -0.2673 -0.2627 -0.0724 0.1249 0.1242 0.0893 0.0988 0.1434 0.0620 0.1388 0.1554 0.1061 0.1039 0.1036 0.0883 0.0944 0.0842 0.0908 0.0888 0.0936 0.0949 0.0899 0.0886 0.1478 0.1492
va: 1.1287 1.9494 2.0299 2.9362 3.6023 3.8249 3.8969 3.9328 3.9050 3.7995 3.8290 3.8029 4.1285 3.9630 3.9498 3.9190 3.9060 3.9195 3.9988 0.9944 0.9954 1.0037 0.9997 0.9980 1.0013 1.0009 0.9921 0.9954 0.9963 1.0029 1.0045 1.0048 1.0003 1.0132 1.0105 1.0069 1.0062 1.0085 1.0063 1.0044 1.0024
dispcorr: -0.023343486 hartree
energy: -1250.395131544998
dipole: -14.10489 14.93486 0.82996 -16.04178 14.32542 -1.71636 -6.10008 5.44819 -0.65189
magnitude: 2.01487 au
magnitude: 5.12139 debye
