program: Orca
programVersion: 5.0.2
elementType: Cl O O N C C C C C C C C C C C C C C C H H H H H H H H H H H H H H H H H H H H H H
charge: 0
multiplicity: 1
keywords: wb97x-d3
keywords: def2-TZVPP
keywords: def2/J RIJCOSX
keywords: DEFGRID2
keywords: scfconv7
keywords: smallprint printgap noloewdin
keywords: NOSOSCF
formula: C15H22ClNO2
InChI: InChI=1/C15H22ClNO2/c1-5-13-8-6-7-12(4)15(13)17(14(18)9-16)10-19-11(2)3/h6-8,11H,5,9-10H2,1-4H3
41 atoms
Cl 2.181065 1.360682 2.30272
O  -2.23257 0.612591 -1.194975
O  -0.307017 3.123897 0.744508
N  -0.333266 0.924436 0.175442
C  0.375151 -0.236741 -0.243711
C  0.467123 -1.337091 0.616201
C  0.897924 -0.274214 -1.543335
C  -1.784989 0.864694 0.097019
C  -0.11949 -1.304641 2.004992
C  1.091273 -2.487314 0.142069
C  -2.655583 -0.717149 -1.474218
C  1.521769 -1.439433 -1.970965
C  0.284393 2.093393 0.523119
C  1.612355 -2.541275 -1.137846
C  0.811979 0.91024 -2.461463
C  0.712107 -2.020735 3.062292
C  -4.072943 -0.949677 -0.969596
C  -2.551281 -0.913154 -2.973693
C  1.796501 2.034925 0.692508
H  -2.166219 1.82917 0.426129
H  -2.139087 0.0971 0.795671
H  -0.255861 -0.269913 2.316986
H  -1.121693 -1.747439 1.977422
H  1.172964 -3.355884 0.782011
H  -1.981393 -1.432959 -0.984438
H  1.93087 -1.484823 -2.972671
H  2.092092 -3.445816 -1.48813
H  1.064657 0.622861 -3.481286
H  -0.18381 1.347727 -2.470433
H  1.511235 1.701236 -2.17817
H  0.275652 -1.867516 4.048846
H  1.730402 -1.634017 3.082478
H  0.762699 -3.097168 2.899765
H  -4.772426 -0.263756 -1.449313
H  -4.394148 -1.969217 -1.18602
H  -4.151809 -0.808752 0.109835
H  -3.188533 -0.205517 -3.506018
H  -2.866412 -1.920429 -3.246141
H  -1.525551 -0.779189 -3.316021
H  2.181435 3.050564 0.659357
H  2.309563 1.420861 -0.042534
totalener: -1250.34582066 hartree
nucrepener: 1724.88479580 hartree
electener: -2975.23061645 hartree
oneelecener: -5136.92117993 hartree
twoeener: 2161.69056348 hartree
kineticenergy: 1246.09738624 hartree
xcener: -99.074101930597 hartree
chargesum: 0.0000000
charge: -0.128591 -0.336464 -0.368565 -0.002451 0.072852 -0.079028 -0.229863 0.029058 -0.208145 -0.042273 0.169692 -0.025883 0.254047 -0.152306 -0.249706 -0.245136 -0.246824 -0.245192 -0.097172 0.111262 0.102734 0.100707 0.081032 0.115556 0.044412 0.108548 0.126253 0.090522 0.124555 0.093193 0.089512 0.088695 0.076243 0.088669 0.082377 0.076339 0.091308 0.081215 0.084978 0.147869 0.125973
qa: -0.1286 -0.3365 -0.3686 -0.0025 0.0729 -0.0790 -0.2299 0.0291 -0.2081 -0.0423 0.1697 -0.0259 0.2540 -0.1523 -0.2497 -0.2451 -0.2468 -0.2452 -0.0972 0.1113 0.1027 0.1007 0.0810 0.1156 0.0444 0.1085 0.1263 0.0905 0.1246 0.0932 0.0895 0.0887 0.0762 0.0887 0.0824 0.0763 0.0913 0.0812 0.0850 0.1479 0.1260
va: 1.1501 1.9625 2.1431 2.9263 3.5474 3.6731 3.9217 3.9535 3.8718 3.8563 3.8582 3.8512 4.1441 4.0442 3.9279 3.9328 3.9398 3.9223 3.9711 1.0465 0.9844 1.0120 0.9986 1.0048 0.9944 1.0097 1.0013 1.0042 1.0137 0.9996 1.0070 1.0159 1.0032 1.0109 1.0109 1.0082 1.0106 1.0098 1.0074 1.0064 1.0078
dispcorr: -0.024875670 hartree
energy: -1250.370696325787
dipole: -15.75383 15.80377 0.04995 -15.55880 14.02348 -1.53532 -11.74147 11.08921 -0.65226
magnitude: 1.66887 au
magnitude: 4.24194 debye
