program: Orca
programVersion: 5.0.2
elementType: Cl O O N C C C C C C C C C C C C C C C H H H H H H H H H H H H H H H H H H H H H H
charge: 0
multiplicity: 1
keywords: wb97x-d3
keywords: def2-TZVPP
keywords: def2/J RIJCOSX
keywords: DEFGRID2
keywords: scfconv7
keywords: smallprint printgap noloewdin
keywords: NOSOSCF
formula: C15H22ClNO2
InChI: InChI=1/C15H22ClNO2/c1-5-13-8-6-7-12(4)15(13)17(14(18)9-16)10-19-11(2)3/h6-8,11H,5,9-10H2,1-4H3
41 atoms
Cl 1.420902 3.08038 1.950373
O  -2.250873 -0.56922 -0.944885
O  -0.781552 2.353925 0.230524
N  -0.07142 0.332933 -0.513251
C  0.957699 -0.653346 -0.531222
C  0.961224 -1.701284 0.390355
C  1.961297 -0.53497 -1.504441
C  -1.188561 0.175728 -1.434289
C  -0.110934 -1.889831 1.429104
C  2.002608 -2.625967 0.330468
C  -3.152314 0.060827 -0.039348
C  2.973239 -1.482977 -1.537797
C  0.04273 1.474522 0.236258
C  2.997538 -2.522965 -0.62138
C  1.958274 0.602346 -2.484798
C  -0.98719 -3.103636 1.128824
C  -3.899113 1.226949 -0.670204
C  -4.113464 -1.022035 0.415602
C  1.303308 1.539631 1.096501
H  -0.816004 -0.378932 -2.296083
H  -1.490042 1.170542 -1.768975
H  0.362155 -2.017342 2.406717
H  -0.73903 -1.002932 1.504141
H  2.027563 -3.438515 1.046909
H  -2.60428 0.431905 0.836122
H  3.755245 -1.400759 -2.28224
H  3.798109 -3.25029 -0.64972
H  2.865551 0.594987 -3.086652
H  1.114456 0.54877 -3.17501
H  1.900635 1.575412 -1.994376
H  -1.745402 -3.232562 1.90184
H  -0.400055 -4.021397 1.087057
H  -1.493514 -2.98294 0.172871
H  -4.638998 1.609678 0.033414
H  -3.242527 2.060182 -0.914815
H  -4.425867 0.910389 -1.572179
H  -4.692198 -1.409352 -0.424316
H  -4.812668 -0.620599 1.148902
H  -3.586758 -1.856202 0.877852
H  2.200624 1.410543 0.491581
H  1.299473 0.735638 1.833213
totalener: -1250.34861672 hartree
nucrepener: 1690.43547976 hartree
electener: -2940.78409648 hartree
oneelecener: -5068.07937742 hartree
twoeener: 2127.29528095 hartree
kineticenergy: 1246.09285071 hartree
xcener: -99.072026958000 hartree
chargesum: 0.0000000
charge: -0.104441 -0.324026 -0.360345 -0.001018 0.125851 -0.171952 -0.213051 0.059950 -0.178308 -0.050813 0.115669 -0.009598 0.223550 -0.162013 -0.237510 -0.280152 -0.259657 -0.234172 -0.081669 0.106461 0.124336 0.099462 0.077096 0.115622 0.056957 0.110252 0.127013 0.091307 0.095295 0.097638 0.088725 0.086997 0.095189 0.078434 0.101049 0.086494 0.084908 0.079713 0.090386 0.126016 0.124353
qa: -0.1044 -0.3240 -0.3603 -0.0010 0.1259 -0.1720 -0.2131 0.0599 -0.1783 -0.0508 0.1157 -0.0096 0.2235 -0.1620 -0.2375 -0.2802 -0.2597 -0.2342 -0.0817 0.1065 0.1243 0.0995 0.0771 0.1156 0.0570 0.1103 0.1270 0.0913 0.0953 0.0976 0.0887 0.0870 0.0952 0.0784 0.1010 0.0865 0.0849 0.0797 0.0904 0.1260 0.1244
va: 1.1698 1.9966 2.1332 2.8778 3.6147 3.8487 3.9621 3.9758 3.8654 3.8626 3.8795 3.8501 4.1382 4.0429 3.9728 3.9188 3.9056 3.9074 4.0370 0.9955 0.9892 0.9975 1.0270 1.0043 1.0003 1.0089 1.0015 1.0072 0.9988 0.9971 1.0012 1.0134 1.0157 1.0126 1.0185 1.0095 1.0116 1.0105 1.0074 1.0043 1.0099
dispcorr: -0.023780896 hartree
energy: -1250.372397612040
dipole: -16.76579 17.31768 0.55189 -17.91587 16.60092 -1.31495 -7.16135 6.67580 -0.48555
magnitude: 1.50646 au
magnitude: 3.82912 debye
