program: Orca
programVersion: 5.0.2
elementType: Cl O O N C C C C C C C C C C C C C C C H H H H H H H H H H H H H H H H H H H H H H
charge: 0
multiplicity: 1
keywords: wb97x-d3
keywords: def2-TZVPP
keywords: def2/J RIJCOSX
keywords: DEFGRID2
keywords: scfconv7
keywords: smallprint printgap noloewdin
keywords: NOSOSCF
formula: C15H22ClNO2
InChI: InChI=1/C15H22ClNO2/c1-5-13-8-6-7-12(4)15(13)17(14(18)9-16)10-19-11(2)3/h6-8,11H,5,9-10H2,1-4H3
41 atoms
Cl 1.911307 2.893202 1.243251
O  -2.355401 -0.528809 -1.096665
O  -1.020531 2.219815 0.528641
N  -0.224362 0.287274 -0.34704
C  0.824394 -0.678338 -0.442628
C  0.724721 -1.901914 0.22448
C  1.925301 -0.376898 -1.255421
C  -1.253965 0.262975 -1.383684
C  -0.451858 -2.27189 1.087165
C  1.774024 -2.807834 0.092431
C  -3.316769 -0.024772 -0.173508
C  2.948448 -1.310237 -1.361482
C  -0.182533 1.348465 0.515076
C  2.878323 -2.517592 -0.687025
C  2.014418 0.927445 -1.993811
C  -0.34915 -1.75542 2.519768
C  -4.049896 1.196214 -0.707967
C  -4.273853 -1.170483 0.097704
C  0.973106 1.401412 1.508105
H  -0.800498 -0.176443 -2.272395
H  -1.526769 1.296246 -1.607935
H  -1.374584 -1.921084 0.630549
H  -0.523778 -3.361394 1.111947
H  1.712696 -3.760338 0.604827
H  -2.823657 0.246498 0.768523
H  3.807184 -1.087456 -1.982262
H  3.681247 -3.237053 -0.779533
H  2.097083 1.778585 -1.316706
H  2.89018 0.942829 -2.640576
H  1.142901 1.104904 -2.625319
H  0.587571 -2.057767 2.98874
H  -1.167058 -2.143815 3.126836
H  -0.408864 -0.668578 2.564777
H  -3.392813 2.056404 -0.824372
H  -4.522437 0.977319 -1.666971
H  -4.831677 1.492019 -0.007823
H  -4.795809 -1.469053 -0.812615
H  -5.021601 -0.870419 0.831699
H  -3.752461 -2.044131 0.489935
H  1.658688 0.561079 1.45921
H  0.554165 1.459042 2.511541
totalener: -1250.34735519 hartree
nucrepener: 1702.31413794 hartree
electener: -2952.66149313 hartree
oneelecener: -5091.81679433 hartree
twoeener: 2139.15530121 hartree
kineticenergy: 1246.08931573 hartree
xcener: -99.070570944184 hartree
chargesum: 0.0000000
charge: -0.118449 -0.326425 -0.374405 0.023978 -0.034246 -0.067791 -0.161659 0.054355 -0.164682 -0.035845 0.124357 -0.026453 0.239384 -0.149468 -0.249223 -0.260985 -0.257450 -0.231001 -0.110266 0.105838 0.124725 0.073714 0.078807 0.109396 0.059296 0.109198 0.126094 0.109266 0.087390 0.095083 0.093876 0.096622 0.067960 0.100748 0.085897 0.078148 0.085154 0.077154 0.085332 0.139274 0.137300
qa: -0.1184 -0.3264 -0.3744 0.0240 -0.0342 -0.0678 -0.1617 0.0544 -0.1647 -0.0358 0.1244 -0.0265 0.2394 -0.1495 -0.2492 -0.2610 -0.2574 -0.2310 -0.1103 0.1058 0.1247 0.0737 0.0788 0.1094 0.0593 0.1092 0.1261 0.1093 0.0874 0.0951 0.0939 0.0966 0.0680 0.1007 0.0859 0.0781 0.0852 0.0772 0.0853 0.1393 0.1373
va: 1.1559 1.9946 2.1310 2.8737 3.8141 3.8812 3.9699 3.9907 3.9044 3.8482 3.8523 3.8648 4.1238 4.0154 3.9461 3.9029 3.9125 3.9169 4.0180 0.9925 0.9885 1.0386 1.0124 1.0083 0.9993 1.0103 1.0015 1.0248 1.0082 0.9977 1.0042 1.0095 1.0120 1.0183 1.0096 1.0116 1.0115 1.0083 1.0069 1.0025 1.0054
dispcorr: -0.024233922 hartree
energy: -1250.371589107483
dipole: -18.10697 18.42746 0.32049 -14.50441 13.30694 -1.19747 -1.64701 1.60356 -0.04345
magnitude: 1.24038 au
magnitude: 3.15279 debye
