program: Orca
programVersion: 5.0.2
elementType: Cl O O N C C C C C C C C C C C C C C C H H H H H H H H H H H H H H H H H H H H H H
charge: 0
multiplicity: 1
keywords: wb97x-d3
keywords: def2-TZVPP
keywords: def2/J RIJCOSX
keywords: DEFGRID2
keywords: scfconv7
keywords: smallprint printgap noloewdin
keywords: NOSOSCF
formula: C15H22ClNO2
InChI: InChI=1/C15H22ClNO2/c1-5-13-8-6-7-12(4)15(13)17(14(18)9-16)10-19-11(2)3/h6-8,11H,5,9-10H2,1-4H3
41 atoms
Cl 1.807627 1.341852 2.387902
O  -2.34956 -0.141771 -1.157599
O  -1.158779 2.227147 0.916945
N  -0.395675 0.233912 0.149462
C  0.691429 -0.548868 -0.340176
C  1.198935 -1.588821 0.446242
C  1.197235 -0.280365 -1.618347
C  -1.731564 -0.337434 0.070313
C  0.621039 -1.91059 1.801805
C  2.242471 -2.350712 -0.072526
C  -3.36304 0.858403 -1.217015
C  2.249231 -1.055095 -2.088961
C  -0.233477 1.503066 0.624006
C  2.76775 -2.085458 -1.323386
C  0.622653 0.807439 -2.478448
C  1.639547 -2.370998 2.837417
C  -3.474883 1.293225 -2.66562
C  -4.682932 0.308593 -0.695571
C  1.195811 1.981153 0.835625
H  -2.319172 0.061491 0.901484
H  -1.619692 -1.413194 0.214754
H  0.100338 -1.037391 2.193043
H  -0.143322 -2.686543 1.683609
H  2.654666 -3.162572 0.511511
H  -3.069121 1.719772 -0.608672
H  2.656585 -0.855197 -3.072138
H  3.582141 -2.686419 -1.706174
H  0.717571 1.799045 -2.030295
H  1.130586 0.843551 -3.440832
H  -0.437557 0.640864 -2.659308
H  2.081243 -3.33656 2.592387
H  1.160908 -2.478179 3.810372
H  2.447179 -1.646923 2.939063
H  -4.255252 2.046779 -2.775665
H  -2.541264 1.728501 -3.022588
H  -3.728433 0.450272 -3.310661
H  -5.012809 -0.543875 -1.291592
H  -5.45927 1.073678 -0.737898
H  -4.607544 -0.014208 0.344275
H  1.184834 3.065481 0.908339
H  1.890719 1.670022 0.059969
totalener: -1250.34770507 hartree
nucrepener: 1696.85747574 hartree
electener: -2947.20518081 hartree
oneelecener: -5081.12903025 hartree
twoeener: 2133.92384944 hartree
kineticenergy: 1246.09130504 hartree
xcener: -99.070861279049 hartree
chargesum: -0.0000000
charge: -0.125935 -0.339535 -0.384960 0.011474 0.059869 -0.054743 -0.225521 0.086283 -0.228028 -0.055253 0.146393 -0.021435 0.256097 -0.155587 -0.257462 -0.249238 -0.243412 -0.251851 -0.088537 0.108202 0.106701 0.098569 0.088769 0.115574 0.066249 0.108217 0.125266 0.080000 0.086149 0.115952 0.077797 0.089004 0.088435 0.083152 0.081918 0.085481 0.081573 0.082272 0.075016 0.146131 0.130953
qa: -0.1259 -0.3395 -0.3850 0.0115 0.0599 -0.0547 -0.2255 0.0863 -0.2280 -0.0553 0.1464 -0.0214 0.2561 -0.1556 -0.2575 -0.2492 -0.2434 -0.2519 -0.0885 0.1082 0.1067 0.0986 0.0888 0.1156 0.0662 0.1082 0.1253 0.0800 0.0861 0.1160 0.0778 0.0890 0.0884 0.0832 0.0819 0.0855 0.0816 0.0823 0.0750 0.1461 0.1310
va: 1.1524 1.9767 2.1137 2.9294 3.7486 3.7363 3.9556 3.9842 3.8984 3.8668 3.8600 3.8558 4.1255 4.0484 3.9537 3.9360 3.9191 3.9308 3.9760 0.9974 0.9959 1.0098 0.9975 1.0061 1.0205 1.0086 1.0021 0.9972 1.0110 1.0118 1.0024 1.0068 1.0150 1.0097 1.0079 1.0106 1.0103 1.0120 1.0102 1.0061 1.0059
dispcorr: -0.023257657 hartree
energy: -1250.370962728230
dipole: -15.22772 15.48805 0.26033 -6.91955 6.35086 -0.56868 -11.42856 10.82343 -0.60513
magnitude: 0.87026 au
magnitude: 2.21203 debye
