program: Orca
programVersion: 5.0.2
elementType: Cl O O N C C C C C C C C C C C C C C C H H H H H H H H H H H H H H H H H H H H H H
charge: 0
multiplicity: 1
keywords: wb97x-d3
keywords: def2-TZVPP
keywords: def2/J RIJCOSX
keywords: DEFGRID2
keywords: scfconv7
keywords: smallprint printgap noloewdin
keywords: NOSOSCF
formula: C15H22ClNO2
InChI: InChI=1/C15H22ClNO2/c1-5-13-8-6-7-12(4)15(13)17(14(18)9-16)10-19-11(2)3/h6-8,11H,5,9-10H2,1-4H3
41 atoms
Cl 2.318476 2.421536 0.768857
O  -2.315513 -0.487676 -0.914098
O  -1.137219 2.393046 0.549188
N  -0.223516 0.506794 -0.31441
C  0.838029 -0.444973 -0.33073
C  0.859042 -1.501347 0.583127
C  1.838278 -0.30348 -1.302621
C  -1.283241 0.354867 -1.302157
C  -0.230609 -1.739128 1.594731
C  1.927929 -2.392657 0.53728
C  -3.339671 0.038707 -0.074016
C  2.875745 -1.225229 -1.32537
C  -0.253365 1.565196 0.54806
C  2.928999 -2.258688 -0.405154
C  1.799776 0.796222 -2.322994
C  -1.049322 -2.983244 1.258269
C  -4.120298 1.163503 -0.738354
C  -4.246217 -1.130205 0.264823
C  0.890606 1.683576 1.544906
H  -0.838653 -0.111575 -2.180655
H  -1.630125 1.35122 -1.581724
H  0.218754 -1.855931 2.584953
H  -0.899901 -0.881954 1.65973
H  1.968249 -3.205833 1.252371
H  -2.902965 0.42129 0.856728
H  3.6591 -1.121453 -2.065787
H  3.753128 -2.959525 -0.424881
H  1.13145 0.547926 -3.150762
H  1.46494 1.743215 -1.904934
H  2.787965 0.957619 -2.750787
H  -1.830606 -3.145577 2.001587
H  -0.426593 -3.877608 1.232388
H  -1.522407 -2.874551 0.283937
H  -3.513007 2.051587 -0.90629
H  -4.542549 0.836007 -1.690008
H  -4.945031 1.467577 -0.092973
H  -5.043075 -0.806123 0.934216
H  -3.697931 -1.930262 0.760864
H  -4.707789 -1.541074 -0.634383
H  1.203353 0.73172 1.966377
H  0.569571 2.348773 2.341845
totalener: -1250.34842047 hartree
nucrepener: 1714.19250816 hartree
electener: -2964.54092863 hartree
oneelecener: -5115.75343863 hartree
twoeener: 2151.21251001 hartree
kineticenergy: 1246.09488609 hartree
xcener: -99.072188757240 hartree
chargesum: 0.0000000
charge: -0.123709 -0.323968 -0.378549 0.007542 0.130404 -0.185160 -0.160596 0.068131 -0.170825 -0.050760 0.120843 -0.023777 0.219454 -0.167028 -0.268224 -0.280664 -0.261283 -0.234180 -0.064532 0.106234 0.123646 0.097431 0.071910 0.113994 0.053707 0.106264 0.124670 0.095977 0.101317 0.093681 0.088559 0.088135 0.094236 0.099470 0.086871 0.078739 0.078877 0.090547 0.084584 0.123384 0.144645
qa: -0.1237 -0.3240 -0.3785 0.0075 0.1304 -0.1852 -0.1606 0.0681 -0.1708 -0.0508 0.1208 -0.0238 0.2195 -0.1670 -0.2682 -0.2807 -0.2613 -0.2342 -0.0645 0.1062 0.1236 0.0974 0.0719 0.1140 0.0537 0.1063 0.1247 0.0960 0.1013 0.0937 0.0886 0.0881 0.0942 0.0995 0.0869 0.0787 0.0789 0.0905 0.0846 0.1234 0.1446
va: 1.1500 1.9985 2.1142 2.8872 3.6342 3.8176 3.8949 3.9716 3.8636 3.8649 3.8761 3.8721 4.1866 4.0490 3.9450 3.9187 3.9063 3.9058 3.9610 0.9996 0.9905 0.9982 1.0251 1.0043 1.0018 1.0091 1.0017 0.9973 1.0148 1.0057 1.0014 1.0127 1.0155 1.0171 1.0097 1.0124 1.0105 1.0082 1.0121 1.0096 1.0088
dispcorr: -0.024565119 hartree
energy: -1250.372985584864
dipole: -21.49321 21.69059 0.19738 -15.08131 14.16085 -0.92046 -2.30672 2.38184 0.07512
magnitude: 0.94438 au
magnitude: 2.40041 debye
