program: Orca
programVersion: 5.0.2
elementType: Cl O O N C C C C C C C C C C C C C C C H H H H H H H H H H H H H H H H H H H H H H
charge: 0
multiplicity: 1
keywords: wb97x-d3
keywords: def2-TZVPP
keywords: def2/J RIJCOSX
keywords: DEFGRID2
keywords: scfconv7
keywords: smallprint printgap noloewdin
keywords: NOSOSCF
formula: C15H22ClNO2
InChI: InChI=1/C15H22ClNO2/c1-5-13-8-6-7-12(4)15(13)17(14(18)9-16)10-19-11(2)3/h6-8,11H,5,9-10H2,1-4H3
41 atoms
Cl 0.82755 1.191069 2.575986
O  -2.248534 -0.368908 -1.134109
O  -0.875606 2.652429 0.030852
N  -0.122453 0.619594 -0.638995
C  0.920365 -0.354543 -0.646925
C  0.850362 -1.487507 0.168129
C  1.985254 -0.151971 -1.535945
C  -1.215668 0.435421 -1.5869
C  -0.316105 -1.746803 1.085751
C  1.891198 -2.41067 0.080776
C  -3.149183 0.185757 -0.180657
C  3.0007 -1.095449 -1.588921
C  -0.040511 1.777399 0.080947
C  2.953536 -2.220297 -0.782004
C  2.039435 1.067925 -2.410728
C  0.047548 -2.415889 2.40524
C  -3.973828 1.329742 -0.752309
C  -4.032595 -0.961792 0.27208
C  1.168724 1.940191 0.990673
H  -0.8033 -0.078778 -2.455909
H  -1.555988 1.424966 -1.899626
H  -0.827077 -0.810758 1.300223
H  -1.043357 -2.362309 0.549362
H  1.86898 -3.298458 0.698256
H  -2.590748 0.559292 0.687356
H  3.831273 -0.949249 -2.268101
H  3.74772 -2.953759 -0.829404
H  2.902986 1.02973 -3.07275
H  1.152664 1.167216 -3.038163
H  2.119461 1.992152 -1.833912
H  0.818998 -1.855109 2.932123
H  0.402582 -3.438434 2.277235
H  -0.828811 -2.464377 3.051333
H  -4.69849 1.665224 -0.009831
H  -3.363924 2.195284 -1.006047
H  -4.524126 1.009694 -1.63871
H  -3.441864 -1.776354 0.691132
H  -4.615271 -1.358302 -0.560824
H  -4.7289 -0.623983 1.039488
H  1.322819 3.002901 1.158455
H  2.080936 1.489754 0.60769
totalener: -1250.34792688 hartree
nucrepener: 1721.17207380 hartree
electener: -2971.52000067 hartree
oneelecener: -5129.72012959 hartree
twoeener: 2158.20012891 hartree
kineticenergy: 1246.09089498 hartree
xcener: -99.072281848600 hartree
chargesum: 0.0000000
charge: -0.122789 -0.318133 -0.377502 0.019780 0.039844 -0.083598 -0.203806 0.063343 -0.209107 -0.055066 0.123471 -0.021034 0.237491 -0.153780 -0.237595 -0.236435 -0.256311 -0.235843 -0.090071 0.104226 0.119137 0.073585 0.093255 0.116322 0.058899 0.108843 0.125165 0.091716 0.100417 0.087499 0.084513 0.078149 0.088409 0.078273 0.098479 0.085719 0.086023 0.085074 0.077390 0.146981 0.129068
qa: -0.1228 -0.3181 -0.3775 0.0198 0.0398 -0.0836 -0.2038 0.0633 -0.2091 -0.0551 0.1235 -0.0210 0.2375 -0.1538 -0.2376 -0.2364 -0.2563 -0.2358 -0.0901 0.1042 0.1191 0.0736 0.0933 0.1163 0.0589 0.1088 0.1252 0.0917 0.1004 0.0875 0.0845 0.0781 0.0884 0.0783 0.0985 0.0857 0.0860 0.0851 0.0774 0.1470 0.1291
va: 1.1533 2.0041 2.1177 2.8657 3.7321 3.8371 3.9593 3.9851 3.9334 3.8509 3.8697 3.8596 4.1408 4.0427 3.9783 3.9098 3.9073 3.9173 3.9581 0.9929 0.9914 1.0136 1.0054 1.0068 0.9980 1.0095 1.0024 1.0080 0.9960 0.9970 1.0167 1.0047 1.0065 1.0120 1.0188 1.0098 1.0093 1.0111 1.0090 1.0051 1.0063
dispcorr: -0.024619080 hartree
energy: -1250.372545955654
dipole: -12.48327 13.23800 0.75474 -8.11412 7.62850 -0.48562 -7.43392 6.87311 -0.56081
magnitude: 1.05828 au
magnitude: 2.68994 debye
