program: Orca
programVersion: 5.0.2
elementType: Cl O O N C C C C C C C C C C C C C C C H H H H H H H H H H H H H H H H H H H H H H
charge: 0
multiplicity: 1
keywords: wb97x-d3
keywords: def2-TZVPP
keywords: def2/J RIJCOSX
keywords: DEFGRID2
keywords: scfconv7
keywords: smallprint printgap noloewdin
keywords: NOSOSCF
formula: C15H22ClNO2
InChI: InChI=1/C15H22ClNO2/c1-5-13-8-6-7-12(4)15(13)17(14(18)9-16)10-19-11(2)3/h6-8,11H,5,9-10H2,1-4H3
41 atoms
Cl 1.349299 2.907087 2.149088
O  -2.251133 -0.47318 -1.164797
O  -0.791135 2.35962 0.293259
N  -0.09007 0.385465 -0.57503
C  0.913499 -0.627389 -0.619091
C  0.830076 -1.733717 0.234887
C  1.957286 -0.485092 -1.538108
C  -1.17586 0.317136 -1.543042
C  -0.321595 -1.870059 1.199111
C  1.8304 -2.696128 0.152348
C  -3.151447 0.049195 -0.192859
C  2.933915 -1.472737 -1.59275
C  0.024967 1.473751 0.249523
C  2.870846 -2.569414 -0.75295
C  2.035062 0.705833 -2.449885
C  -0.214451 -3.006818 2.2026
C  -3.909511 1.270267 -0.692243
C  -4.099547 -1.085754 0.147712
C  1.287311 1.480274 1.110723
H  -0.776535 -0.150263 -2.443754
H  -1.469172 1.340589 -1.786324
H  -0.454473 -0.932451 1.746349
H  -1.23606 -1.989094 0.615905
H  1.800733 -3.561837 0.799408
H  -2.599531 0.328238 0.713774
H  3.750094 -1.376702 -2.297748
H  3.637161 -3.33185 -0.80111
H  2.969501 0.703137 -3.007724
H  1.225071 0.713661 -3.180171
H  1.979726 1.651625 -1.910396
H  -1.07391 -2.990747 2.871929
H  0.681433 -2.926724 2.819322
H  -0.204192 -3.983207 1.717463
H  -4.448369 1.045932 -1.614514
H  -4.639495 1.57919 0.056462
H  -3.256356 2.124723 -0.861396
H  -4.805232 -0.770493 0.916104
H  -3.56409 -1.957746 0.524384
H  -4.671396 -1.393725 -0.72889
H  2.180082 1.471111 0.485069
H  1.334929 0.592638 1.741396
totalener: -1250.34813218 hartree
nucrepener: 1685.52676616 hartree
electener: -2935.87489834 hartree
oneelecener: -5058.21223498 hartree
twoeener: 2122.33733664 hartree
kineticenergy: 1246.09415416 hartree
xcener: -99.074770790345 hartree
chargesum: -0.0000000
charge: -0.104056 -0.327473 -0.359419 -0.000488 0.100960 -0.171864 -0.214671 0.063720 -0.114850 -0.057815 0.121658 -0.016865 0.220772 -0.162385 -0.239065 -0.278307 -0.254777 -0.230764 -0.083429 0.104084 0.119722 0.068319 0.091228 0.121410 0.060016 0.109533 0.126196 0.091894 0.095972 0.095568 0.094634 0.088786 0.082260 0.085512 0.078528 0.101076 0.078150 0.082085 0.086209 0.122493 0.125443
qa: -0.1041 -0.3275 -0.3594 -0.0005 0.1010 -0.1719 -0.2147 0.0637 -0.1149 -0.0578 0.1217 -0.0169 0.2208 -0.1624 -0.2391 -0.2783 -0.2548 -0.2308 -0.0834 0.1041 0.1197 0.0683 0.0912 0.1214 0.0600 0.1095 0.1262 0.0919 0.0960 0.0956 0.0946 0.0888 0.0823 0.0855 0.0785 0.1011 0.0782 0.0821 0.0862 0.1225 0.1254
va: 1.1690 1.9919 2.1339 2.8853 3.6758 3.8966 3.9566 3.9938 3.8866 3.8418 3.8617 3.8590 4.1368 4.0675 3.9684 3.9610 3.9102 3.9199 4.0371 0.9953 0.9902 1.0012 1.0185 1.0065 0.9963 1.0089 1.0028 1.0069 0.9986 0.9985 1.0067 1.0002 0.9973 1.0094 1.0122 1.0183 1.0085 1.0080 1.0116 1.0073 1.0085
dispcorr: -0.023090176 hartree
energy: -1250.371222360196
dipole: -15.05552 15.58717 0.53165 -16.94087 15.66535 -1.27552 -6.40224 5.86579 -0.53645
magnitude: 1.48236 au
magnitude: 3.76785 debye
