program: Orca
programVersion: 5.0.2
elementType: Cl O O N C C C C C C C C C C C C C C C H H H H H H H H H H H H H H H H H H H H H H
charge: 0
multiplicity: 1
keywords: wb97x-d3
keywords: def2-TZVPP
keywords: def2/J RIJCOSX
keywords: DEFGRID2
keywords: scfconv7
keywords: smallprint printgap noloewdin
keywords: NOSOSCF
formula: C15H22ClNO2
InChI: InChI=1/C15H22ClNO2/c1-5-13-8-6-7-12(4)15(13)17(14(18)9-16)10-19-11(2)3/h6-8,11H,5,9-10H2,1-4H3
41 atoms
Cl 1.983377 1.516145 2.238724
O  -2.320637 -0.206535 -1.023054
O  -1.110996 2.267115 0.912883
N  -0.324355 0.265989 0.192612
C  0.773429 -0.510799 -0.284509
C  1.367361 -1.456377 0.554568
C  1.220154 -0.320143 -1.599816
C  -1.648489 -0.338638 0.184758
C  0.887123 -1.733318 1.954231
C  2.442344 -2.192783 0.062008
C  -3.344971 0.783596 -1.087195
C  2.297551 -1.071876 -2.048656
C  -0.178102 1.557449 0.60857
C  2.90915 -2.002366 -1.22346
C  0.558472 0.665434 -2.518305
C  0.21817 -3.101323 2.082834
C  -3.504562 1.167118 -2.54598
C  -4.642307 0.240242 -0.506635
C  1.242963 2.091407 0.718595
H  -2.214286 0.076422 1.023154
H  -1.503515 -1.404934 0.362168
H  1.742507 -1.686587 2.631958
H  0.20416 -0.954883 2.290948
H  2.92295 -2.918791 0.707011
H  -3.04127 1.667783 -0.518383
H  2.657717 -0.929463 -3.059823
H  3.750679 -2.577438 -1.586892
H  0.5758 1.685398 -2.128104
H  1.05771 0.684105 -3.485568
H  -0.486391 0.406799 -2.679005
H  -0.649453 -3.189017 1.428387
H  -0.11828 -3.271765 3.105544
H  0.901894 -3.908883 1.820623
H  -3.769163 0.300261 -3.153459
H  -4.295252 1.909041 -2.657919
H  -2.586558 1.597991 -2.945871
H  -4.980678 -0.635502 -1.062634
H  -5.427544 0.995886 -0.551517
H  -4.531124 -0.045437 0.540731
H  1.193876 3.175756 0.766621
H  1.895817 1.788115 -0.095833
totalener: -1250.34792299 hartree
nucrepener: 1698.71604367 hartree
electener: -2949.06396665 hartree
oneelecener: -5084.85279193 hartree
twoeener: 2135.78882528 hartree
kineticenergy: 1246.09439538 hartree
xcener: -99.069926546768 hartree
chargesum: -0.0000000
charge: -0.125395 -0.342291 -0.386726 0.011476 0.077574 -0.098530 -0.215711 0.081430 -0.214111 -0.044329 0.145389 -0.011579 0.257934 -0.165322 -0.262247 -0.231181 -0.244529 -0.252165 -0.084369 0.108428 0.112079 0.094362 0.081467 0.113552 0.067616 0.108619 0.125104 0.080499 0.086339 0.117243 0.077865 0.090047 0.077102 0.085839 0.083664 0.081339 0.081617 0.082118 0.075224 0.145349 0.129208
qa: -0.1254 -0.3423 -0.3867 0.0115 0.0776 -0.0985 -0.2157 0.0814 -0.2141 -0.0443 0.1454 -0.0116 0.2579 -0.1653 -0.2622 -0.2312 -0.2445 -0.2522 -0.0844 0.1084 0.1121 0.0944 0.0815 0.1136 0.0676 0.1086 0.1251 0.0805 0.0863 0.1172 0.0779 0.0900 0.0771 0.0858 0.0837 0.0813 0.0816 0.0821 0.0752 0.1453 0.1292
va: 1.1492 1.9762 2.1116 2.9301 3.7000 3.7503 3.9423 3.9809 3.9212 3.8685 3.8579 3.8437 4.1348 4.0497 3.9593 3.9288 3.9170 3.9347 3.9774 0.9972 1.0033 1.0014 1.0189 1.0051 1.0210 1.0081 1.0018 0.9972 1.0112 1.0100 1.0085 1.0068 1.0073 1.0101 1.0103 1.0083 1.0102 1.0119 1.0099 1.0068 1.0059
dispcorr: -0.023402719 hartree
energy: -1250.371325706931
dipole: -18.46586 18.73591 0.27005 -9.36411 8.75901 -0.60510 -11.89494 11.30813 -0.58681
magnitude: 0.88511 au
magnitude: 2.24977 debye
