program: Orca
programVersion: 5.0.2
elementType: Cl O N C C C C C C C C C C C H H H H H H H H H H H H H H
charge: 0
multiplicity: 1
keywords: wb97x-d3
keywords: def2-TZVPP
keywords: def2/J RIJCOSX
keywords: DEFGRID2
keywords: scfconv7
keywords: smallprint printgap noloewdin
keywords: NOSOSCF
formula: C11H14ClNO
InChI: InChI=1/C11H14ClNO/c1-9(2)13(11(14)8-12)10-6-4-3-5-7-10/h3-7,9H,8H2,1-2H3
28 atoms
Cl 2.859605 1.654526 -0.888403
O  0.304603 1.588699 1.526923
N  0.312674 -0.162058 0.109175
C  0.999876 -1.197993 -0.68576
C  -1.106923 -0.241501 0.226684
C  0.374254 -1.344865 -2.063153
C  1.054756 -2.527693 0.050731
C  0.924974 0.807995 0.81464
C  -1.685402 -1.048551 1.197871
C  -1.912533 0.495645 -0.632734
C  2.429749 0.946897 0.70645
C  -3.067729 -1.13334 1.294026
C  -3.293457 0.412475 -0.530707
C  -3.873372 -0.40462 0.430738
H  2.021112 -0.858735 -0.83869
H  -0.639926 -1.741834 -2.01625
H  0.351285 -0.395066 -2.597161
H  0.972215 -2.042216 -2.649945
H  1.499762 -2.417025 1.040011
H  1.66865 -3.229188 -0.514957
H  0.06595 -2.973166 0.163497
H  -1.058489 -1.605364 1.88172
H  -1.458771 1.131618 -1.381788
H  2.770504 1.641775 1.468658
H  2.967133 0.007697 0.821121
H  -3.513311 -1.766222 2.049982
H  -3.916181 0.987814 -1.202922
H  -4.950559 -0.470597 0.508447
elementType: Cl O N C H
totalener: -1017.86071195 hartree
nucrepener: 1010.56631623 hartree
electener: -2028.42702818 hartree
oneelecener: -3398.40734108 hartree
twoeener: 1369.98031289 hartree
cpcmener: -0.03128656 hartree
kineticenergy: 1014.66160806 hartree
xcener: -76.253376192698 hartree
chargesum: 0.0000000
charge: -0.165158 -0.546109 -0.056596 0.075290 0.140156 -0.282791 -0.295675 0.330791 -0.264385 -0.251551 -0.075779 -0.109922 -0.100494 -0.163279 0.079832 0.101477 0.098123 0.108707 0.099111 0.105259 0.094048 0.159279 0.145111 0.144924 0.146936 0.160765 0.159756 0.162173
qa: -0.1652 -0.5461 -0.0566 0.0753 0.1402 -0.2828 -0.2957 0.3308 -0.2644 -0.2516 -0.0758 -0.1099 -0.1005 -0.1633 0.0798 0.1015 0.0981 0.1087 0.0991 0.1053 0.0940 0.1593 0.1451 0.1449 0.1469 0.1608 0.1598 0.1622
va: 1.1069 1.9411 3.0242 3.8751 3.5030 3.9073 3.9286 4.1074 4.0198 4.0472 3.9608 3.8689 3.8637 3.9029 1.0139 0.9966 1.0106 1.0058 1.0069 1.0063 1.0001 0.9986 1.0113 1.0158 0.9960 0.9910 0.9904 0.9893
dispcorr: -0.013591336 hartree
energy: -1017.874303291198
dipole: -6.70938 7.06623 0.35685 -15.36327 13.16681 -2.19647 -1.89982 1.24190 -0.65792
magnitude: 2.32049 au
magnitude: 5.89822 debye
