program: Orca
programVersion: 5.0.2
elementType: Cl O N C C C C C C C C C C C H H H H H H H H H H H H H H
charge: 0
multiplicity: 1
keywords: wb97x-d3
keywords: def2-TZVPP
keywords: def2/J RIJCOSX
keywords: DEFGRID2
keywords: scfconv7
keywords: smallprint printgap noloewdin
keywords: NOSOSCF
formula: C11H14ClNO
InChI: InChI=1/C11H14ClNO/c1-9(2)13(11(14)8-12)10-6-4-3-5-7-10/h3-7,9H,8H2,1-2H3
28 atoms
Cl 1.834701 3.142597 0.308232
O  2.605741 0.424855 -0.271801
N  0.58625 -0.588885 -0.095005
C  1.146773 -1.945912 -0.244021
C  -0.832237 -0.450508 -0.10166
C  0.846538 -2.522296 -1.619468
C  0.679133 -2.875353 0.864429
C  1.393152 0.493342 -0.151888
C  -1.554158 -0.573325 1.080277
C  -1.499221 -0.209676 -1.297764
C  0.682051 1.83558 -0.046642
C  -2.936534 -0.458192 1.062672
C  -2.881525 -0.088858 -1.310673
C  -3.602275 -0.216482 -0.131475
H  2.224346 -1.830354 -0.148048
H  1.359188 -3.477958 -1.733971
H  -0.219859 -2.703646 -1.761179
H  1.192764 -1.861646 -2.414817
H  -0.388966 -3.087958 0.80769
H  0.899411 -2.469812 1.851964
H  1.205475 -3.825959 0.772962
H  -1.034651 -0.749936 2.012888
H  -0.93479 -0.111194 -2.216444
H  0.189974 2.073374 -0.989494
H  -0.07303 1.837593 0.735696
H  -3.493296 -0.554307 1.98532
H  -3.39393 0.101969 -2.244309
H  -4.68045 -0.126248 -0.142416
elementType: Cl O N C H
totalener: -1017.86290089 hartree
nucrepener: 1001.15497333 hartree
electener: -2019.01787423 hartree
oneelecener: -3379.14272299 hartree
twoeener: 1360.12484876 hartree
cpcmener: -0.02921378 hartree
kineticenergy: 1014.65917335 hartree
xcener: -76.255516743927 hartree
chargesum: -0.0000000
charge: -0.159484 -0.532287 -0.050637 0.156607 0.097687 -0.305462 -0.313999 0.327895 -0.271313 -0.289647 -0.097692 -0.082217 -0.099137 -0.163127 0.070480 0.106283 0.092312 0.101837 0.096152 0.102378 0.105836 0.153915 0.161724 0.152469 0.154173 0.161087 0.161638 0.162529
qa: -0.1595 -0.5323 -0.0506 0.1566 0.0977 -0.3055 -0.3140 0.3279 -0.2713 -0.2896 -0.0977 -0.0822 -0.0991 -0.1631 0.0705 0.1063 0.0923 0.1018 0.0962 0.1024 0.1058 0.1539 0.1617 0.1525 0.1542 0.1611 0.1616 0.1625
va: 1.1194 1.9753 3.0125 3.7652 3.5179 3.9257 3.9335 4.1291 4.0102 4.0209 3.9924 3.8376 3.8528 3.9180 1.0383 1.0065 0.9983 1.0051 0.9965 1.0057 1.0065 1.0066 0.9996 1.0023 1.0014 0.9898 0.9898 0.9890
dispcorr: -0.013254782 hartree
energy: -1017.876155675102
dipole: -9.40278 6.57427 -2.82851 -20.45576 19.09964 -1.35612 -2.51302 2.39100 -0.12201
magnitude: 3.13918 au
magnitude: 7.97916 debye
