program: Orca
programVersion: 5.0.2
elementType: Cl O N C C C C C C C C C C C H H H H H H H H H H H H H H
charge: 0
multiplicity: 1
keywords: wb97x-d3
keywords: def2-TZVPP
keywords: def2/J RIJCOSX
keywords: DEFGRID2
keywords: scfconv7
keywords: smallprint printgap noloewdin
keywords: NOSOSCF
formula: C11H14ClNO
InChI: InChI=1/C11H14ClNO/c1-9(2)13(11(14)8-12)10-6-4-3-5-7-10/h3-7,9H,8H2,1-2H3
28 atoms
Cl 1.870341 2.964082 0.38194
O  2.436111 0.210845 -0.273548
N  0.359285 -0.655249 -0.057095
C  0.807341 -2.06477 -0.087543
C  -1.046204 -0.435432 -0.034682
C  1.78808 -2.412019 1.024498
C  1.305596 -2.477233 -1.46573
C  1.237372 0.368997 -0.143062
C  -1.708417 0.014514 -1.170976
C  -1.767236 -0.711359 1.123108
C  0.630511 1.766579 -0.057026
C  -3.081924 0.215672 -1.138841
C  -3.140729 -0.525858 1.145195
C  -3.800272 -0.055571 0.016462
H  -0.102919 -2.633247 0.108483
H  1.439427 -2.041808 1.989613
H  1.865109 -3.497668 1.099877
H  2.788182 -2.022823 0.847036
H  1.471161 -3.555588 -1.485664
H  2.244294 -1.992506 -1.730013
H  0.568718 -2.245533 -2.236344
H  -1.150825 0.210205 -2.078716
H  -1.250313 -1.065622 2.006547
H  0.217162 2.059328 -1.022012
H  -0.165465 1.826699 0.682358
H  -3.59059 0.577145 -2.023166
H  -3.695912 -0.741838 2.048871
H  -4.871431 0.097408 0.038725
elementType: Cl O N C H
totalener: -1017.86789228 hartree
nucrepener: 997.35736368 hartree
electener: -2015.22525596 hartree
oneelecener: -3371.69542097 hartree
twoeener: 1356.47016501 hartree
cpcmener: -0.02364483 hartree
kineticenergy: 1014.64846231 hartree
xcener: -76.249587363534 hartree
chargesum: -0.0000000
charge: -0.156186 -0.493533 -0.046353 0.096638 0.051764 -0.269846 -0.292094 0.314381 -0.235380 -0.222588 -0.114573 -0.125312 -0.111268 -0.142800 0.077509 0.092565 0.101757 0.092560 0.101471 0.091898 0.094482 0.160671 0.152172 0.151019 0.154840 0.157910 0.158374 0.159922
qa: -0.1562 -0.4935 -0.0464 0.0966 0.0518 -0.2698 -0.2921 0.3144 -0.2354 -0.2226 -0.1146 -0.1253 -0.1113 -0.1428 0.0775 0.0926 0.1018 0.0926 0.1015 0.0919 0.0945 0.1607 0.1522 0.1510 0.1548 0.1579 0.1584 0.1599
va: 1.1225 2.0130 3.0284 3.8242 3.6188 3.8834 3.9235 4.1146 4.0227 4.0135 4.0240 3.8964 3.8720 3.8927 0.9971 1.0073 1.0030 1.0192 1.0020 1.0162 1.0047 1.0004 1.0070 1.0013 0.9981 0.9920 0.9915 0.9897
dispcorr: -0.012994740 hartree
energy: -1017.880887020421
dipole: -6.47992 3.74363 -2.73629 -18.53713 17.40315 -1.13398 -2.00248 1.93177 -0.07071
magnitude: 2.96280 au
magnitude: 7.53085 debye
