program: Orca
programVersion: 5.0.2
elementType: Cl O N C C C C C C C C C C C H H H H H H H H H H H H H H
charge: 0
multiplicity: 1
keywords: wb97x-d3
keywords: def2-TZVPP
keywords: def2/J RIJCOSX
keywords: DEFGRID2
keywords: scfconv7
keywords: smallprint printgap noloewdin
keywords: NOSOSCF
formula: C11H14ClNO
InChI: InChI=1/C11H14ClNO/c1-9(2)13(11(14)8-12)10-6-4-3-5-7-10/h3-7,9H,8H2,1-2H3
28 atoms
Cl 2.862226 1.652852 -0.894409
O  0.305866 1.585361 1.527978
N  0.312141 -0.166157 0.111234
C  0.998977 -1.199976 -0.684287
C  -1.10709 -0.243651 0.22959
C  0.377222 -1.3438 -2.064452
C  1.053392 -2.532857 0.047904
C  0.924183 0.809717 0.816042
C  -1.6880 -1.048253 1.201392
C  -1.911984 0.493944 -0.63026
C  2.429786 0.952738 0.70284
C  -3.07038 -1.13229 1.296035
C  -3.292933 0.411967 -0.529964
C  -3.874542 -0.404436 0.430874
H  2.020799 -0.86049 -0.835069
H  -0.63739 -1.740948 -2.023239
H  0.355627 -0.392115 -2.595756
H  0.976019 -2.03872 -2.65417
H  1.493559 -2.426274 1.040225
H  1.671357 -3.233249 -0.515644
H  0.065384 -2.981958 0.155388
H  -1.062118 -1.602528 1.888648
H  -1.455972 1.131468 -1.377064
H  2.767014 1.652734 1.462391
H  2.971781 0.016669 0.824103
H  -3.517513 -1.763383 2.053088
H  -3.914756 0.988466 -1.202594
H  -4.952206 -0.46972 0.507378
elementType: Cl O N C H
totalener: -1017.86789418 hartree
nucrepener: 1010.18925820 hartree
electener: -2028.05715238 hartree
oneelecener: -3397.60041835 hartree
twoeener: 1369.54326597 hartree
cpcmener: -0.02510342 hartree
kineticenergy: 1014.65608871 hartree
xcener: -76.250795274028 hartree
chargesum: 0.0000000
charge: -0.163500 -0.504090 -0.064133 0.068955 0.155312 -0.281644 -0.294149 0.306955 -0.264723 -0.250550 -0.078015 -0.106953 -0.097557 -0.160679 0.077977 0.101517 0.097762 0.106882 0.097574 0.104212 0.093957 0.154905 0.141334 0.145175 0.142472 0.156810 0.155928 0.158266
qa: -0.1635 -0.5041 -0.0641 0.0690 0.1553 -0.2816 -0.2941 0.3070 -0.2647 -0.2505 -0.0780 -0.1070 -0.0976 -0.1607 0.0780 0.1015 0.0978 0.1069 0.0976 0.1042 0.0940 0.1549 0.1413 0.1452 0.1425 0.1568 0.1559 0.1583
va: 1.1087 1.9937 3.0048 3.8829 3.5082 3.9083 3.9264 4.1404 4.0281 4.0566 3.9538 3.8751 3.8704 3.9111 1.0140 0.9969 1.0110 1.0061 1.0071 1.0069 1.0004 0.9999 1.0122 1.0158 0.9963 0.9922 0.9916 0.9905
dispcorr: -0.013590484 hartree
energy: -1017.881484663598
dipole: -6.71310 7.02754 0.31443 -15.34148 13.30083 -2.04065 -1.89061 1.30444 -0.58616
magnitude: 2.14633 au
magnitude: 5.45553 debye
