program: Orca
programVersion: 5.0.2
elementType: Cl O O N C C C C C C C C C C C C C C C C C H H H H H H H H H H H H H H H H H H H H H H H H H H
charge: 0
multiplicity: 1
keywords: wb97x-d3
keywords: def2-TZVPP
keywords: def2/J RIJCOSX
keywords: DEFGRID2
keywords: scfconv7
keywords: smallprint printgap noloewdin
keywords: NOSOSCF
formula: C17H26ClNO2
InChI: InChI=1/C17H26ClNO2/c1-4-11-21-12-10-19(16(20)13-18)17-14(5-2)8-7-9-15(17)6-3/h7-9H,4-6,10-13H2,1-3H3
47 atoms
Cl -1.108932 -2.631033 2.723537
O  2.588134 0.247579 -0.869775
O  0.04048 -3.026805 -0.030889
N  -0.270232 -0.857512 -0.553202
C  -0.978834 0.373788 -0.388115
C  -2.001783 0.687322 -1.287596
C  -0.615202 1.246871 0.650063
C  0.682083 -0.974521 -1.661675
C  -2.469381 -0.259313 -2.361694
C  0.451962 0.861642 1.642451
C  2.145321 -1.023559 -1.271012
C  -2.654622 1.910072 -1.147328
C  -1.299656 2.452618 0.756547
C  -0.542061 -1.97309 0.159901
C  -2.306457 2.786394 -0.137092
C  -3.700083 -1.052605 -1.9308
C  0.926513 1.973757 2.563283
C  3.91314 0.237068 -0.387395
C  -1.658134 -1.903375 1.187811
C  4.318577 1.633369 0.033025
C  4.297874 2.647419 -1.100612
H  0.457279 -1.878699 -2.229796
H  0.517924 -0.131867 -2.333257
H  -1.684572 -0.953689 -2.658432
H  -2.71552 0.318784 -3.255096
H  0.086584 0.036347 2.261407
H  1.307921 0.460283 1.102504
H  2.313337 -1.767162 -0.483331
H  2.70745 -1.365576 -2.15202
H  -3.446767 2.16953 -1.839995
H  -1.047542 3.1499 1.544094
H  -2.822199 3.733218 -0.038421
H  -4.53346 -0.393976 -1.682135
H  -3.493404 -1.669239 -1.055518
H  -4.029224 -1.716599 -2.731299
H  1.739605 1.608423 3.190872
H  0.139954 2.325006 3.231741
H  1.302674 2.833482 2.007072
H  4.003119 -0.451067 0.464734
H  4.598919 -0.131853 -1.16498
H  -2.493554 -2.50247 0.825289
H  -2.026649 -0.906248 1.404332
H  3.676984 1.970892 0.852799
H  5.327913 1.564503 0.446758
H  4.924405 2.321724 -1.933519
H  4.675932 3.614446 -0.766458
H  3.291405 2.809127 -1.487176
elementType: Cl O N C H
totalener: -1328.99847293 hartree
nucrepener: 1967.27150376 hartree
electener: -3296.26997670 hartree
oneelecener: -5726.06943361 hartree
twoeener: 2429.79945691 hartree
cpcmener: -0.02661840 hartree
kineticenergy: 1324.25260616 hartree
xcener: -107.421174765672 hartree
chargesum: -0.0000000
charge: -0.160341 -0.370135 -0.502582 0.013328 0.063420 -0.114073 -0.131489 -0.035994 -0.150250 -0.093226 -0.014660 -0.099222 -0.105704 0.323989 -0.181574 -0.269507 -0.319074 0.002547 -0.108027 -0.110466 -0.256226 0.105271 0.111262 0.090093 0.088273 0.084025 0.074378 0.090258 0.095414 0.139398 0.144845 0.155302 0.088015 0.083832 0.096921 0.102478 0.097060 0.094884 0.097947 0.092511 0.160113 0.151899 0.059998 0.069784 0.077082 0.090347 0.077875
qa: -0.1603 -0.3701 -0.5026 0.0133 0.0634 -0.1141 -0.1315 -0.0360 -0.1503 -0.0932 -0.0147 -0.0992 -0.1057 0.3240 -0.1816 -0.2695 -0.3191 0.0025 -0.1080 -0.1105 -0.2562 0.1053 0.1113 0.0901 0.0883 0.0840 0.0744 0.0903 0.0954 0.1394 0.1448 0.1553 0.0880 0.0838 0.0969 0.1025 0.0971 0.0949 0.0979 0.0925 0.1601 0.1519 0.0600 0.0698 0.0771 0.0903 0.0779
va: 1.1117 1.9294 2.0179 3.0047 3.7795 3.8706 3.8528 3.8358 3.9020 3.8709 3.9316 3.8319 3.8023 4.0891 3.9898 3.9105 3.9613 3.8744 3.9945 3.9306 3.9198 1.0186 1.0085 1.0055 1.0025 1.0204 1.0142 1.0070 0.9985 0.9992 0.9993 0.9925 1.0029 1.0072 1.0054 1.0008 0.9985 0.9964 0.9960 0.9947 1.0079 0.9986 1.0070 1.0135 1.0033 1.0050 1.0126
dispcorr: -0.026558362 hartree
energy: -1329.025031295980
dipole: 13.96361 -14.35773 -0.39412 19.00860 -17.38422 1.62437 -12.34090 11.34053 -1.00037
magnitude: 1.94799 au
magnitude: 4.95140 debye
