program: Orca
programVersion: 5.0.2
elementType: Cl O O N C C C C C C C C C C C C C C C C C H H H H H H H H H H H H H H H H H H H H H H H H H H
charge: 0
multiplicity: 1
keywords: wb97x-d3
keywords: def2-TZVPP
keywords: def2/J RIJCOSX
keywords: DEFGRID2
keywords: scfconv7
keywords: smallprint printgap noloewdin
keywords: NOSOSCF
formula: C17H26ClNO2
InChI: InChI=1/C17H26ClNO2/c1-4-11-21-12-10-19(16(20)13-18)17-14(5-2)8-7-9-15(17)6-3/h7-9H,4-6,10-13H2,1-3H3
47 atoms
Cl -1.422702 -3.144233 1.251664
O  2.278053 0.374502 -1.337277
O  0.892674 -1.46617 2.22809
N  0.231876 0.239403 0.912029
C  -0.788657 0.989378 0.247885
C  -1.246169 0.60251 -1.018201
C  -1.276411 2.143457 0.87808
C  1.591942 0.783332 0.915924
C  -0.805269 -0.660688 -1.713241
C  -0.873396 2.544665 2.273045
C  2.567442 0.066337 0.004877
C  -2.183765 1.415882 -1.652787
C  -2.211772 2.923611 0.20734
C  0.004861 -0.883916 1.626738
C  -2.659828 2.568004 -1.053801
C  -1.969573 -1.58209 -2.068331
C  -1.839018 2.009158 3.326886
C  2.808653 -0.538283 -2.273017
C  -1.417736 -1.410997 1.691012
C  4.324621 -0.511661 -2.395443
C  4.798307 -1.469874 -3.478642
H  1.534414 1.832444 0.62552
H  1.987853 0.758998 1.932091
H  -0.08947 -1.2111 -1.10524
H  -0.276428 -0.393273 -2.632053
H  0.137253 2.21544 2.512524
H  -0.857868 3.635163 2.330732
H  3.576413 0.399208 0.281426
H  2.532827 -1.015759 0.178068
H  -2.54247 1.142628 -2.637849
H  -2.591108 3.820856 0.682494
H  -3.38173 3.188625 -1.569425
H  -2.643502 -1.127386 -2.794979
H  -2.559348 -1.847473 -1.190317
H  -1.597165 -2.508356 -2.507868
H  -1.543222 2.339682 4.323539
H  -1.862232 0.918755 3.335543
H  -2.856498 2.360532 3.148835
H  2.479223 -1.560604 -2.035731
H  2.362725 -0.276184 -3.236356
H  -2.12749 -0.903333 1.045605
H  -1.770612 -1.334781 2.719583
H  4.653455 0.505586 -2.62579
H  4.789246 -0.785582 -1.444053
H  5.884803 -1.45891 -3.568762
H  4.38552 -1.207496 -4.454814
H  4.49962 -2.497464 -3.26181
elementType: Cl O N C H
totalener: -1328.99651739 hartree
nucrepener: 1962.66619620 hartree
electener: -3291.66271359 hartree
oneelecener: -5716.84333430 hartree
twoeener: 2425.18062071 hartree
cpcmener: -0.02771223 hartree
kineticenergy: 1324.22870401 hartree
xcener: -107.415583987112 hartree
chargesum: -0.0000000
charge: -0.156712 -0.374241 -0.504374 0.023158 0.109725 -0.148468 -0.118091 -0.029172 -0.142544 -0.146063 -0.027852 -0.097334 -0.088304 0.305017 -0.183913 -0.276779 -0.270948 0.010512 -0.098876 -0.076027 -0.276920 0.110147 0.106045 0.062961 0.097621 0.089174 0.086686 0.094139 0.091910 0.142662 0.139156 0.155546 0.091856 0.074819 0.098354 0.097066 0.084656 0.088360 0.075389 0.093646 0.146458 0.162408 0.058966 0.064151 0.092856 0.081702 0.081476
qa: -0.1567 -0.3742 -0.5044 0.0232 0.1097 -0.1485 -0.1181 -0.0292 -0.1425 -0.1461 -0.0279 -0.0973 -0.0883 0.3050 -0.1839 -0.2768 -0.2709 0.0105 -0.0989 -0.0760 -0.2769 0.1101 0.1060 0.0630 0.0976 0.0892 0.0867 0.0941 0.0919 0.1427 0.1392 0.1555 0.0919 0.0748 0.0984 0.0971 0.0847 0.0884 0.0754 0.0936 0.1465 0.1624 0.0590 0.0642 0.0929 0.0817 0.0815
va: 1.1182 1.9297 2.0142 2.9913 3.7054 3.7952 3.8722 3.8320 3.8766 3.9039 3.9552 3.8164 3.8210 4.1012 3.9613 3.9233 3.9108 3.9180 4.0081 3.8659 3.9509 1.0087 1.0210 1.0185 1.0027 1.0047 1.0027 0.9944 0.9989 0.9982 0.9998 0.9918 1.0070 1.0119 1.0031 1.0056 1.0055 1.0025 0.9945 0.9931 0.9945 1.0043 1.0133 1.0103 1.0033 1.0016 1.0015
dispcorr: -0.026970490 hartree
energy: -1329.023487884261
dipole: 13.21124 -13.63930 -0.42806 9.81907 -8.13315 1.68592 -13.28137 12.57717 -0.70420
magnitude: 1.87656 au
magnitude: 4.76984 debye
