program: Orca
programVersion: 5.0.2
elementType: Cl O O N C C C C C C C C C C C C C C C C C H H H H H H H H H H H H H H H H H H H H H H H H H H
charge: 0
multiplicity: 1
keywords: wb97x-d3
keywords: def2-TZVPP
keywords: def2/J RIJCOSX
keywords: DEFGRID2
keywords: scfconv7
keywords: smallprint printgap noloewdin
keywords: NOSOSCF
formula: C17H26ClNO2
InChI: InChI=1/C17H26ClNO2/c1-4-11-21-12-10-19(16(20)13-18)17-14(5-2)8-7-9-15(17)6-3/h7-9H,4-6,10-13H2,1-3H3
47 atoms
Cl -1.223387 -1.706041 2.913031
O  3.335425 0.382472 -0.872046
O  0.56721 -2.400971 0.320135
N  -0.243152 -0.365954 -0.219428
C  -1.327282 0.56497 -0.239215
C  -2.217608 0.521892 -1.321304
C  -1.47827 1.497191 0.793122
C  0.960505 -0.065388 -0.990713
C  -2.075736 -0.462784 -2.45283
C  -0.495295 1.655053 1.922447
C  2.152592 0.322126 -0.113066
C  -3.293523 1.402284 -1.330186
C  -2.582121 2.347804 0.753179
C  -0.330239 -1.575216 0.377952
C  -3.486327 2.299911 -0.292193
C  -2.930891 -1.712689 -2.265309
C  0.251242 2.984698 1.840387
C  4.003156 -0.856856 -1.004359
C  -1.58709 -1.89405 1.167296
C  5.262345 -0.662499 -1.822869
C  6.262682 0.297296 -1.194849
H  1.211845 -0.927287 -1.612276
H  0.72467 0.7567 -1.665574
H  -1.035556 -0.756228 -2.596615
H  -2.379108 0.032963 -3.377715
H  -1.031187 1.605249 2.873089
H  0.219419 0.834135 1.938255
H  1.991732 1.316412 0.308409
H  2.259629 -0.372807 0.727854
H  -3.991165 1.37875 -2.159443
H  -2.729408 3.06018 1.556635
H  -4.337551 2.968878 -0.304344
H  -2.626431 -2.290231 -1.391147
H  -2.845048 -2.36791 -3.133878
H  -3.985381 -1.45829 -2.143796
H  0.994339 3.058334 2.635702
H  -0.426441 3.833339 1.944017
H  0.771048 3.096295 0.887638
H  4.259802 -1.254089 -0.011566
H  3.361942 -1.605788 -1.487243
H  -1.847533 -2.937214 1.000633
H  -2.446464 -1.270899 0.941388
H  5.723756 -1.645986 -1.945137
H  4.995338 -0.324788 -2.828439
H  7.168919 0.368332 -1.800053
H  6.560449 -0.038562 -0.198208
H  5.857759 1.306227 -1.097396
elementType: Cl O N C H
totalener: -1328.99653459 hartree
nucrepener: 1936.10265120 hartree
electener: -3265.09918579 hartree
oneelecener: -5663.33267746 hartree
twoeener: 2398.23349167 hartree
cpcmener: -0.02657498 hartree
kineticenergy: 1324.22770497 hartree
xcener: -107.412864254132 hartree
chargesum: -0.0000000
charge: -0.157713 -0.389364 -0.501163 0.015287 0.074269 -0.117008 -0.109733 -0.067635 -0.159682 -0.189332 -0.006218 -0.061712 -0.077753 0.292632 -0.193821 -0.273637 -0.280408 0.019845 -0.090427 -0.098336 -0.255822 0.116146 0.119458 0.091665 0.090015 0.095470 0.068349 0.118514 0.096724 0.141103 0.141384 0.155390 0.085649 0.098527 0.088900 0.100301 0.093350 0.087369 0.082983 0.087437 0.158068 0.146117 0.062216 0.059133 0.089774 0.075943 0.077747
qa: -0.1577 -0.3894 -0.5012 0.0153 0.0743 -0.1170 -0.1097 -0.0676 -0.1597 -0.1893 -0.0062 -0.0617 -0.0778 0.2926 -0.1938 -0.2736 -0.2804 0.0198 -0.0904 -0.0983 -0.2558 0.1161 0.1195 0.0917 0.0900 0.0955 0.0683 0.1185 0.0967 0.1411 0.1414 0.1554 0.0856 0.0985 0.0889 0.1003 0.0934 0.0874 0.0830 0.0874 0.1581 0.1461 0.0622 0.0591 0.0898 0.0759 0.0777
va: 1.1157 1.9477 2.0109 2.9577 3.6824 3.8918 3.7496 3.7166 3.9048 3.8659 3.9237 3.7936 3.8098 4.1303 3.9668 3.9152 3.9276 3.8944 3.9612 3.9133 3.9149 1.0041 1.0052 1.0032 1.0019 1.0064 1.0217 1.0040 1.0092 0.9986 0.9982 0.9918 1.0038 1.0053 1.0015 1.0032 1.0052 1.0021 0.9932 0.9933 1.0029 1.0050 1.0119 1.0141 1.0046 1.0030 1.0145
dispcorr: -0.026240177 hartree
energy: -1329.022774771354
dipole: 17.30729 -18.74504 -1.43775 9.07771 -8.08846 0.98925 -16.36880 15.40653 -0.96227
magnitude: 1.99292 au
magnitude: 5.06559 debye
