program: Orca
programVersion: 5.0.2
elementType: Cl O O N C C C C C C C C C C C C C C C C C H H H H H H H H H H H H H H H H H H H H H H H H H H
charge: 0
multiplicity: 1
keywords: wb97x-d3
keywords: def2-TZVPP
keywords: def2/J RIJCOSX
keywords: DEFGRID2
keywords: scfconv7
keywords: smallprint printgap noloewdin
keywords: NOSOSCF
formula: C17H26ClNO2
InChI: InChI=1/C17H26ClNO2/c1-4-11-21-12-10-19(16(20)13-18)17-14(5-2)8-7-9-15(17)6-3/h7-9H,4-6,10-13H2,1-3H3
47 atoms
Cl -1.974196 -2.699024 1.464964
O  3.045609 -0.056933 -1.315001
O  0.905815 -1.347412 2.213812
N  0.001573 0.073212 0.713967
C  -1.12951 0.819542 0.258464
C  -1.863683 0.366647 -0.843429
C  -1.451933 2.016451 0.911048
C  1.317117 0.445806 0.195906
C  -1.484998 -0.854971 -1.635073
C  -0.676947 2.54289 2.091563
C  2.05823 -0.674932 -0.525377
C  -2.965073 1.114657 -1.25251
C  -2.554004 2.737642 0.462265
C  -0.077944 -0.810729 1.730987
C  -3.312621 2.288147 -0.605555
C  -0.737045 -0.48888 -2.914884
C  -1.399549 2.327151 3.41832
C  3.949376 -0.970833 -1.89358
C  -1.45743 -1.170742 2.252593
C  4.96113 -0.217426 -2.733187
C  5.988963 -1.157851 -3.344141
H  1.154225 1.261033 -0.508096
H  1.938236 0.840426 1.00487
H  -2.392287 -1.403942 -1.896658
H  -0.879615 -1.536083 -1.038957
H  0.316416 2.09814 2.145627
H  -0.518796 3.61444 1.948215
H  2.513995 -1.366798 0.190952
H  1.367071 -1.260171 -1.145584
H  -3.554443 0.768478 -2.093673
H  -2.817058 3.665096 0.957673
H  -4.171549 2.856852 -0.938585
H  -0.459933 -1.386704 -3.469346
H  0.178312 0.066171 -2.704118
H  -1.351894 0.129104 -3.571059
H  -2.387219 2.790324 3.415885
H  -0.829869 2.766848 4.238018
H  -1.531412 1.268507 3.642927
H  4.46463 -1.546438 -1.110578
H  3.413902 -1.700082 -2.519202
H  -2.230861 -0.433022 2.065687
H  -1.39182 -1.361784 3.321131
H  4.442731 0.33031 -3.524934
H  5.465739 0.526673 -2.110713
H  6.706658 -0.611644 -3.956766
H  5.51811 -1.906882 -3.983557
H  6.552917 -1.688312 -2.574635
elementType: Cl O N C H
totalener: -1328.99720585 hartree
nucrepener: 1924.68297315 hartree
electener: -3253.68017900 hartree
oneelecener: -5640.52439815 hartree
twoeener: 2386.84421915 hartree
cpcmener: -0.02598495 hartree
kineticenergy: 1324.24134003 hartree
xcener: -107.413410296620 hartree
chargesum: -0.0000000
charge: -0.158351 -0.376541 -0.499380 0.003125 0.057816 -0.073353 -0.106615 -0.060783 -0.185962 -0.162249 -0.018012 -0.080680 -0.073691 0.299491 -0.187568 -0.278381 -0.270069 0.043330 -0.092651 -0.080833 -0.279094 0.112124 0.118382 0.095279 0.064989 0.086396 0.093117 0.106023 0.101130 0.141204 0.143219 0.156003 0.100676 0.085002 0.092893 0.087712 0.097250 0.087152 0.071303 0.067384 0.144393 0.157148 0.059507 0.057644 0.092918 0.080904 0.080699
qa: -0.1584 -0.3765 -0.4994 0.0031 0.0578 -0.0734 -0.1066 -0.0608 -0.1860 -0.1622 -0.0180 -0.0807 -0.0737 0.2995 -0.1876 -0.2784 -0.2701 0.0433 -0.0927 -0.0808 -0.2791 0.1121 0.1184 0.0953 0.0650 0.0864 0.0931 0.1060 0.1011 0.1412 0.1432 0.1560 0.1007 0.0850 0.0929 0.0877 0.0972 0.0872 0.0713 0.0674 0.1444 0.1571 0.0595 0.0576 0.0929 0.0809 0.0807
va: 1.1175 1.9322 2.0163 2.9311 3.6522 3.7606 3.8732 3.8010 3.8770 3.8852 3.8795 3.8164 3.8053 4.1160 3.9632 3.9139 3.9143 3.9031 3.9686 3.8988 3.9565 1.0085 1.0095 1.0038 1.0251 1.0114 1.0013 1.0194 0.9805 0.9982 0.9975 0.9915 1.0038 1.0030 1.0064 1.0025 1.0051 1.0029 0.9922 0.9890 1.0073 1.0035 1.0111 1.0134 1.0034 1.0012 1.0014
dispcorr: -0.025828228 hartree
energy: -1329.023034073629
dipole: 20.80453 -21.64319 -0.83866 10.73751 -9.35677 1.38074 -15.93867 15.23153 -0.70715
magnitude: 1.76348 au
magnitude: 4.48240 debye
