program: Orca
programVersion: 5.0.2
elementType: Cl O O N C C C C C C C C C C C C C C C C C H H H H H H H H H H H H H H H H H H H H H H H H H H
charge: 0
multiplicity: 1
keywords: wb97x-d3
keywords: def2-TZVPP
keywords: def2/J RIJCOSX
keywords: DEFGRID2
keywords: scfconv7
keywords: smallprint printgap noloewdin
keywords: NOSOSCF
formula: C17H26ClNO2
InChI: InChI=1/C17H26ClNO2/c1-4-11-21-12-10-19(16(20)13-18)17-14(5-2)8-7-9-15(17)6-3/h7-9H,4-6,10-13H2,1-3H3
47 atoms
Cl -1.306516 -2.069981 2.681459
O  3.151686 0.180205 -1.052359
O  0.13525 -2.795147 -0.135427
N  -0.348854 -0.60139 -0.337409
C  -1.31054 0.453857 -0.253828
C  -2.280551 0.5598 -1.259295
C  -1.24025 1.38056 0.792282
C  0.857948 -0.362139 -1.12863
C  -2.377116 -0.409009 -2.408848
C  -0.156566 1.360168 1.834511
C  2.153504 -0.506148 -0.337006
C  -3.20741 1.594946 -1.178153
C  -2.191361 2.396644 0.838355
C  -0.602236 -1.852469 0.103097
C  -3.16979 2.504755 -0.134981
C  -3.509202 -1.41794 -2.238388
C  0.947608 2.367699 1.519892
C  4.423318 0.078906 -0.452211
C  -1.83316 -2.064735 0.965613
C  5.425605 0.892551 -1.244288
C  6.813363 0.82006 -0.625174
H  0.872757 -1.021057 -2.001045
H  0.790208 0.65963 -1.500586
H  -1.437697 -0.941031 -2.559225
H  -2.549812 0.160639 -3.325032
H  -0.594128 1.604188 2.805222
H  0.27009 0.363227 1.936886
H  2.033687 -0.083218 0.668603
H  2.423665 -1.560529 -0.21215
H  -3.964655 1.689492 -1.947999
H  -2.158078 3.113689 1.650454
H  -3.900209 3.302308 -0.084354
H  -3.361827 -2.050999 -1.363019
H  -3.572793 -2.072809 -3.108448
H  -4.473544 -0.920049 -2.12751
H  1.742719 2.314224 2.265257
H  0.562518 3.388778 1.519677
H  1.397199 2.187978 0.542039
H  4.386208 0.441887 0.585634
H  4.744082 -0.972158 -0.406589
H  -2.254119 -3.044059 0.749783
H  -2.606747 -1.310032 0.865872
H  5.459672 0.526652 -2.274098
H  5.094847 1.933896 -1.287932
H  6.818835 1.213262 0.393214
H  7.53245 1.401402 -1.202878
H  7.181123 -0.206907 -0.584082
elementType: Cl O N C H
totalener: -1328.99711619 hartree
nucrepener: 1926.74713977 hartree
electener: -3255.74425596 hartree
oneelecener: -5644.62709797 hartree
twoeener: 2388.88284201 hartree
cpcmener: -0.02600528 hartree
kineticenergy: 1324.23847722 hartree
xcener: -107.412988739628 hartree
chargesum: -0.0000000
charge: -0.158267 -0.376747 -0.497701 0.004368 0.030603 -0.098700 -0.056051 -0.055451 -0.159761 -0.184260 -0.026404 -0.076895 -0.080917 0.295682 -0.186832 -0.268183 -0.281555 0.041764 -0.093389 -0.078921 -0.278215 0.118961 0.110904 0.086675 0.093054 0.095693 0.064858 0.098790 0.109547 0.142364 0.140943 0.155797 0.086204 0.097281 0.087428 0.101546 0.094194 0.086334 0.066505 0.074734 0.157330 0.145673 0.058544 0.058534 0.080472 0.093011 0.080455
qa: -0.1583 -0.3767 -0.4977 0.0044 0.0306 -0.0987 -0.0561 -0.0555 -0.1598 -0.1843 -0.0264 -0.0769 -0.0809 0.2957 -0.1868 -0.2682 -0.2816 0.0418 -0.0934 -0.0789 -0.2782 0.1190 0.1109 0.0867 0.0931 0.0957 0.0649 0.0988 0.1095 0.1424 0.1409 0.1558 0.0862 0.0973 0.0874 0.1015 0.0942 0.0863 0.0665 0.0747 0.1573 0.1457 0.0585 0.0585 0.0805 0.0930 0.0805
va: 1.1171 1.9301 2.0185 2.9281 3.6801 3.8715 3.7586 3.7922 3.8841 3.8762 3.8884 3.8137 3.8159 4.1221 3.9623 3.9141 3.9093 3.8984 3.9662 3.8990 3.9559 1.0101 1.0092 1.0109 1.0017 1.0039 1.0262 0.9776 1.0188 0.9980 0.9985 0.9915 1.0037 1.0052 1.0026 1.0040 1.0067 1.0034 0.9898 0.9926 1.0033 1.0062 1.0127 1.0118 1.0013 1.0033 1.0014
dispcorr: -0.025964983 hartree
energy: -1329.023081168289
dipole: 20.46360 -21.31410 -0.85050 13.69434 -12.10546 1.58888 -12.90708 12.52553 -0.38156
magnitude: 1.84214 au
magnitude: 4.68234 debye
