program: Orca
programVersion: 5.0.2
elementType: Cl O O N C C C C C C C C C C C C C C C C C H H H H H H H H H H H H H H H H H H H H H H H H H H
charge: 0
multiplicity: 1
keywords: wb97x-d3
keywords: def2-TZVPP
keywords: def2/J RIJCOSX
keywords: DEFGRID2
keywords: scfconv7
keywords: smallprint printgap noloewdin
keywords: NOSOSCF
formula: C17H26ClNO2
InChI: InChI=1/C17H26ClNO2/c1-4-11-21-12-10-19(16(20)13-18)17-14(5-2)8-7-9-15(17)6-3/h7-9H,4-6,10-13H2,1-3H3
47 atoms
Cl -2.765897 -3.023257 2.256352
O  2.256634 0.583175 -1.179109
O  -0.084549 -3.189933 1.250741
N  0.167908 -1.121255 0.36354
C  -0.379678 0.18683 0.188831
C  -1.177538 0.458027 -0.93102
C  -0.129568 1.165396 1.160055
C  1.562292 -1.390294 0.014223
C  -1.506282 -0.58109 -1.97291
C  0.711774 0.910176 2.382134
C  2.036531 -0.798347 -1.293576
C  -1.72349 1.733306 -1.057633
C  -0.692065 2.426384 0.991399
C  -0.533835 -2.086298 1.008636
C  -1.483956 2.711235 -0.108174
C  -1.163291 -0.151339 -3.395202
C  2.067103 1.611206 2.323205
C  2.809108 1.154072 -2.343648
C  -1.94613 -1.688382 1.419126
C  3.126325 2.613476 -2.094286
C  1.911872 3.456448 -1.736081
H  2.225392 -1.067766 0.823503
H  1.674095 -2.46965 -0.069255
H  -2.577032 -0.801833 -1.919453
H  -0.997446 -1.518451 -1.750859
H  0.167439 1.271018 3.258669
H  0.861713 -0.157917 2.540756
H  2.975533 -1.310338 -1.548301
H  1.329297 -1.030243 -2.100587
H  -2.358501 1.95991 -1.905608
H  -0.515775 3.189836 1.74043
H  -1.923366 3.694379 -0.220608
H  -1.385701 -0.955877 -4.097271
H  -0.104896 0.093464 -3.495962
H  -1.735294 0.721562 -3.710788
H  2.639325 1.414808 3.231064
H  1.95224 2.692702 2.235475
H  2.660533 1.271391 1.474689
H  3.72544 0.618793 -2.631816
H  2.109229 1.059184 -3.187273
H  -2.551861 -1.420123 0.554793
H  -1.930293 -0.83191 2.092568
H  3.881902 2.689804 -1.306748
H  3.59302 3.002872 -3.002868
H  1.145431 3.40113 -2.512051
H  2.186982 4.505944 -1.622436
H  1.458238 3.138001 -0.797574
elementType: Cl O N C H
totalener: -1328.99670135 hartree
nucrepener: 2000.62212855 hartree
electener: -3329.61882990 hartree
oneelecener: -5792.63481449 hartree
twoeener: 2463.01598459 hartree
cpcmener: -0.02891281 hartree
kineticenergy: 1324.24970683 hartree
xcener: -107.423595354445 hartree
chargesum: -0.0000000
charge: -0.152523 -0.347804 -0.486101 -0.017627 0.123517 -0.118237 -0.139265 -0.059895 -0.182437 -0.160009 -0.027628 -0.070501 -0.065601 0.288939 -0.209922 -0.266603 -0.268454 0.001302 -0.078250 -0.103267 -0.236664 0.112366 0.112283 0.100017 0.089919 0.094825 0.083348 0.110756 0.101953 0.137880 0.134741 0.152411 0.097800 0.079878 0.090192 0.100447 0.089677 0.068904 0.087810 0.080563 0.147272 0.147557 0.063145 0.068511 0.078815 0.097205 0.048755
qa: -0.1525 -0.3478 -0.4861 -0.0176 0.1235 -0.1182 -0.1393 -0.0599 -0.1824 -0.1600 -0.0276 -0.0705 -0.0656 0.2889 -0.2099 -0.2666 -0.2685 0.0013 -0.0783 -0.1033 -0.2367 0.1124 0.1123 0.1000 0.0899 0.0948 0.0833 0.1108 0.1020 0.1379 0.1347 0.1524 0.0978 0.0799 0.0902 0.1004 0.0897 0.0689 0.0878 0.0806 0.1473 0.1476 0.0631 0.0685 0.0788 0.0972 0.0488
va: 1.1265 1.9304 2.0263 2.9897 3.4843 3.7482 3.7650 3.8308 3.8486 3.8573 3.9436 3.7656 3.7247 4.1327 3.9420 3.9355 3.8979 3.9055 3.9996 3.9143 3.9171 1.0015 1.0320 0.9971 1.0125 1.0003 1.0126 1.0014 0.9800 0.9991 1.0003 0.9936 1.0052 0.9974 1.0037 1.0061 1.0020 1.0301 0.9989 0.9821 1.0056 1.0039 1.0114 1.0133 1.0040 1.0090 1.0116
dispcorr: -0.029337854 hartree
energy: -1329.026039207386
dipole: 21.13619 -20.59060 0.54559 25.76782 -23.50676 2.26106 -20.04911 18.42628 -1.62283
magnitude: 2.83613 au
magnitude: 7.20887 debye
