program: Orca
programVersion: 5.0.2
elementType: Cl O O N C C C C C C C C C C C C C C C C C H H H H H H H H H H H H H H H H H H H H H H H H H H
charge: 0
multiplicity: 1
keywords: wb97x-d3
keywords: def2-TZVPP
keywords: def2/J RIJCOSX
keywords: DEFGRID2
keywords: scfconv7
keywords: smallprint printgap noloewdin
keywords: NOSOSCF
formula: C17H26ClNO2
InChI: InChI=1/C17H26ClNO2/c1-4-11-21-12-10-19(16(20)13-18)17-14(5-2)8-7-9-15(17)6-3/h7-9H,4-6,10-13H2,1-3H3
47 atoms
Cl -3.021643 -2.693041 1.378836
O  2.47319 0.472335 -1.008006
O  -0.011817 -3.087733 1.234843
N  0.156999 -1.100135 0.189362
C  -0.318289 0.228701 -0.031446
C  -1.205621 0.474903 -1.085292
C  0.146334 1.261766 0.790774
C  1.363083 -1.586378 -0.494402
C  -1.722717 -0.614858 -1.988236
C  1.116309 1.035086 1.918714
C  1.892072 -0.672215 -1.57244
C  -1.627508 1.785587 -1.299981
C  -0.311146 2.552959 0.551534
C  -0.45026 -1.968006 1.024986
C  -1.189365 2.816484 -0.487292
C  -3.240769 -0.764795 -1.936971
C  0.459059 1.129288 3.292604
C  2.6988 1.503477 -1.941365
C  -1.720368 -1.513185 1.7220
C  3.246463 2.724259 -1.231939
C  4.56593 2.482779 -0.515038
H  2.151423 -1.77557 0.238521
H  1.133598 -2.543341 -0.96584
H  -1.262524 -1.571594 -1.742084
H  -1.423996 -0.389573 -3.015847
H  1.613013 0.070652 1.821119
H  1.902845 1.790667 1.852884
H  2.635919 -1.245478 -2.142865
H  1.098921 -0.409083 -2.284061
H  -2.305727 1.999433 -2.117618
H  0.03999 3.36475 1.178185
H  -1.525669 3.829687 -0.668398
H  -3.750371 0.144513 -2.256884
H  -3.584878 -1.003793 -0.930754
H  -3.564808 -1.570519 -2.596923
H  -0.310098 0.368001 3.425084
H  -0.009781 2.101981 3.446926
H  1.199043 0.991191 4.081821
H  3.404387 1.172984 -2.718275
H  1.76198 1.763211 -2.454282
H  -2.08087 -0.533063 1.428641
H  -1.553498 -1.517945 2.798322
H  3.373623 3.504614 -1.986374
H  2.498863 3.101088 -0.528199
H  4.467507 1.752988 0.288329
H  4.942401 3.404824 -0.071542
H  5.330116 2.116231 -1.203718
elementType: Cl O N C H
totalener: -1328.99516054 hartree
nucrepener: 2005.80431007 hartree
electener: -3334.79947061 hartree
oneelecener: -5802.81315634 hartree
twoeener: 2468.01368572 hartree
cpcmener: -0.02799133 hartree
kineticenergy: 1324.26129564 hartree
xcener: -107.423190986319 hartree
chargesum: 0.0000000
charge: -0.161550 -0.353003 -0.506813 -0.005129 0.115779 -0.116422 -0.110948 -0.059540 -0.172692 -0.163768 -0.024700 -0.092856 -0.102654 0.332952 -0.171307 -0.271711 -0.269333 0.011979 -0.098736 -0.121764 -0.259343 0.107877 0.110225 0.083770 0.096477 0.083911 0.079492 0.107557 0.099041 0.140703 0.139738 0.155341 0.087561 0.077134 0.096378 0.085257 0.085917 0.096208 0.090503 0.088630 0.145182 0.155767 0.075991 0.063779 0.077133 0.091354 0.080633
qa: -0.1615 -0.3530 -0.5068 -0.0051 0.1158 -0.1164 -0.1109 -0.0595 -0.1727 -0.1638 -0.0247 -0.0929 -0.1027 0.3330 -0.1713 -0.2717 -0.2693 0.0120 -0.0987 -0.1218 -0.2593 0.1079 0.1102 0.0838 0.0965 0.0839 0.0795 0.1076 0.0990 0.1407 0.1397 0.1553 0.0876 0.0771 0.0964 0.0853 0.0859 0.0962 0.0905 0.0886 0.1452 0.1558 0.0760 0.0638 0.0771 0.0914 0.0806
va: 1.1135 1.9379 2.0218 2.9860 3.4950 3.7875 3.7600 3.8361 3.8530 3.8829 3.9965 3.8119 3.7521 4.0768 3.9454 3.9263 3.9329 3.8787 3.9856 3.9152 3.9254 1.0108 1.0111 1.0140 0.9991 1.0109 1.0027 1.0025 0.9831 0.9981 0.9985 0.9906 1.0062 1.0204 1.0039 1.0052 1.0033 1.0043 0.9968 0.9947 1.0014 1.0075 1.0138 1.0113 1.0108 1.0045 1.0033
dispcorr: -0.029405356 hartree
energy: -1329.024565898451
dipole: 19.62722 -19.15210 0.47512 21.54166 -19.02060 2.52106 -9.16211 7.87456 -1.28755
magnitude: 2.87041 au
magnitude: 7.29601 debye
