program: Gaussian 09
title: 000006417
version: EM64L-G09RevD.01
frameworkgroup: C1[X(C5H10O2)]
method: RPBEPBE
basis: SDD
operation: Freq
keyword: #pfreq=noraman
keyword: PBEPBE/SDD
title: #p freq=noraman PBEPBE/SDD
converged: NO YES NO NO
title: Mulliken charges:
elementType: O O C C C C C H H H H H H H H H H
charge: -0.430168 -0.225956 0.189566 -0.691031 -0.690050 -0.691071 0.154859 0.241733 0.218705 0.213678 0.227408 0.227443 0.204301 0.241776 0.213640 0.218682 0.376486
chargesum: 0.00000
title: Mulliken charges with hydrogens summed into heavy atoms:
elementType: O O C C C C C
charge: -0.053682 -0.225956 0.189566 -0.016915 -0.030899 -0.016973 0.154859
polarizability: 6.40618721e+01 4.62185440e-01 6.29232012e+01 -6.67736952e-04 -1.69186324e-03 5.21352728e+01
1716.lowfreq: -21.3619 -8.0490 -0.0008 -0.0006 -0.0005 16.5741 40.5969 175.6295 214.3107
frequency: 40.3182 175.5954 214.3014 241.1370 253.7871 259.1348 332.8203 344.6878 361.5801 489.9505 538.0431 596.7327 687.3144 729.8688 847.3006 932.9268 942.0627 953.5483 1007.2392 1024.0485 1052.0951 1206.5183 1208.8498 1243.6904 1297.5272 1372.8684 1382.0270 1406.8689 1452.7727 1464.9508 1469.8568 1474.0448 1478.5693 1497.9564 1649.7522 2984.3349 2985.5681 2992.4448 3077.7304 3080.8858 3091.5488 3095.6696 3101.1803 3104.7236 3516.0693
redmass: 6.2073 1.0506 1.4969 2.3089 1.1931 1.4963 2.6344 3.0508 2.2382 3.8300 3.6037 1.1853 3.9273 5.0304 2.4348 1.7330 1.5987 1.2021 1.8991 1.4169 1.8787 2.8849 1.9991 2.6291 2.7973 1.1792 1.2001 1.2137 1.0490 1.0485 1.0477 1.0486 1.0546 1.0705 8.5346 1.0348 1.0353 1.0359 1.1006 1.0999 1.1000 1.1002 1.1001 1.0997 1.0640
irintensity: 0.3113 0.0477 0.1235 0.3043 0.0487 0.0184 1.5660 8.0418 1.0200 15.0431 13.8616 123.3900 8.6152 28.2102 7.8268 3.1151 4.2767 0.0956 142.4147 0.2183 145.1751 7.2343 8.7759 1.5601 17.0141 17.2021 15.0494 14.6323 0.0039 0.0267 2.2300 13.9284 15.3660 31.1978 231.6905 34.1544 15.0297 22.8053 13.6801 20.9885 47.8003 20.1478 14.5628 40.0304 19.3651
temp: 298.150 k
press: 1.00000 atm
elementType: 8 8 6 6 6 6 6 1 1 1 1 1 1 1 1 1 1
symmnumber: 1
zpe: 374795.4 jmol-1
zpe.correction: 0.142752 hartree
zpe.thermalcorrener: 0.151359 hartree
zpe.thermalcorrenthalpy: 0.152303 hartree
zpe.thermalcorrgfe: 0.110014 hartree
zpe.sumelectzpe: -346.413381 hartree
zpe.sumelectthermal: -346.404774 hartree
zpe.sumelectthermalent: -346.403830 hartree
zpe.sumelectthermalfe: -346.446119 hartree
dipole: -0.8353 -1.5049 0.0007
dipole: 1.7212
quadrupole: -39.2878 -48.2974 -42.5506
quadrupole: -4.0280 0.0003 0.0001
quadrupole: 4.0908 -4.9188 0.8280 -4.0280 0.0003 0.0001
hfenergy: -346.5561334 hartree
pointgroup: C01 [X(C5H10O2)]
dipole: -0.3884854 0.554646 -0.000181 debye
dipolederiv: -0.5114063 -0.4571564 -0.0011118 -0.3672316 -1.0189036 -0.0020132 -0.0009631 -0.0021874 -0.4067424 -0.7512691 0.3368863 -0.0005926 0.0569108 -0.8713964 -0.0008426 -0.001023 -0.0002088 -0.2709643 -0.1372456 0.0627536 -0.0007069 0.1384093 0.056221 0.0002753 -0.0007988 0.0001102 0.104916 0.0186116 -0.0025081 -0.0138744 -0.0431997 0.0065504 0.0387002 0.0368934 0.035242 0.0095069 0.0454454 -0.0253847 0.0000235 -0.0225692 -0.0608383 -0.0002002 0.0001007 -0.0001917 0.0259511 0.0188987 -0.002377 0.0138963 -0.0429792 0.0065394 -0.0389622 -0.0367046 -0.0353229 0.009283 1.230912 -0.0066891 0.0030266 0.1211333 1.4559976 0.0026521 0.0030804 0.0023413 0.0973021 0.0872261 -0.0796403 0.0020407 -0.0593649 -0.1094815 0.0383848 -0.0030353 -0.0056385 0.0821396 0.076996 0.0453985 0.0658185 0.0413284 0.0307876 -0.1156785 0.0371091 -0.0647927 -0.106569 -0.1747121 0.0246723 -0.0257638 0.0106516 0.0955483 0.0176689 0.0070276 0.0134672 0.0736255 0.0856869 0.0403997 -0.0681348 0.0070343 0.014673 0.0813042 -0.0486868 0.1127088 -0.0721799 0.0851567 0.0408568 0.0689668 0.0073675 0.0150518 -0.0810755 0.0494588 -0.1123244 -0.0718678 -0.1734424 -0.0237092 -0.0006881 0.0367282 0.0755227 0.0000838 -0.0006396 -0.0000638 0.0991106 0.0873091 -0.079627 -0.0021382 -0.0591509 -0.1093858 -0.0389256 0.0029615 0.004958 0.0821214 -0.1748768 0.0247166 0.0245565 0.0107194 0.0956154 -0.0175752 -0.0083219 -0.0132991 0.0736666 0.0775033 0.0451611 -0.0648188 0.0408068 0.0305341 0.1160807 -0.0360863 0.0652431 -0.1069134 0.1092064 0.056247 -0.0004996 0.123406 0.2869642 0.0001229 -0.0003721 -0.0000411 0.3776141 unknown
polarizability: 64.1451571|-0.3343389|62.8398176|0.0288839|0.0169524|52.1353715 unknown
InChI: InChI=1S/C5H10O2/c1-5(2,3)4(6)7/h6H,1-3H3
charge 0 multiplicity 1
17 atoms
O  1.475899 1.215352 0.008475
O  1.633102 -1.092955 0.004747
C  -0.624568 -0.02047 0.001223
C  -1.095487 0.742857 -1.272106
C  -1.174668 -1.465942 -0.001309
C  -1.102013 0.741046 1.273063
C  0.908633 -0.072478 0.004824
H  -0.697589 1.771195 -1.287879
H  -0.767852 0.225438 -2.192054
H  -2.199729 0.790061 -1.28098
H  -0.836823 -2.023794 0.889116
H  -0.832393 -2.022247 -0.890999
H  -2.279443 -1.441737 -0.003984
H  -0.704245 1.769363 1.292329
H  -2.206287 0.788252 1.27642
H  -0.779123 0.222402 2.1940
H  2.467485 1.128054 0.010615
