program: Orca
programVersion: 5.0.2
elementType: Cl O O N C C C C C C C C C C C C C C C C C H H H H H H H H H H H H H H H H H H H H H H H H H H
charge: 0
multiplicity: 1
keywords: wb97x-d3
keywords: def2-TZVPP
keywords: def2/J RIJCOSX
keywords: DEFGRID2
keywords: scfconv7
keywords: smallprint printgap noloewdin
keywords: NOSOSCF
formula: C17H26ClNO2
InChI: InChI=1/C17H26ClNO2/c1-4-11-21-12-10-19(16(20)13-18)17-14(5-2)8-7-9-15(17)6-3/h7-9H,4-6,10-13H2,1-3H3
47 atoms
Cl -2.638944 -2.324096 1.291377
O  2.752625 0.243319 -0.932399
O  0.532267 -3.017507 0.449903
N  0.068709 -0.922602 -0.244735
C  -0.676462 0.289483 -0.11648
C  -1.824489 0.446706 -0.910984
C  -0.238366 1.299009 0.748991
C  0.861294 -1.120655 -1.459399
C  -2.284395 -0.640714 -1.850714
C  0.964544 1.161792 1.648141
C  2.36198 -1.062599 -1.266455
C  -2.518618 1.648893 -0.832468
C  -0.964796 2.487978 0.789318
C  -0.057766 -1.960858 0.610027
C  -2.089817 2.665034 0.006396
C  -3.790051 -0.714406 -2.062421
C  0.647003 1.388303 3.12342
C  4.139118 0.360832 -0.708446
C  -0.997983 -1.798803 1.789669
C  4.479632 1.78322 -0.316294
C  4.101453 2.819771 -1.363737
H  0.609825 -2.085114 -1.904362
H  0.565218 -0.356364 -2.177823
H  -1.942363 -1.610618 -1.490585
H  -1.794522 -0.49869 -2.819901
H  1.4304 0.185199 1.529859
H  1.717259 1.890671 1.336159
H  2.686028 -1.778589 -0.501511
H  2.826546 -1.379216 -2.211802
H  -3.405695 1.800643 -1.43329
H  -0.638089 3.288891 1.441544
H  -2.637707 3.597934 0.048058
H  -4.186416 0.153894 -2.588836
H  -4.322368 -0.805182 -1.114716
H  -4.035719 -1.590012 -2.664203
H  1.543512 1.243828 3.727786
H  -0.110296 0.692746 3.488136
H  0.286104 2.398809 3.316387
H  4.458446 -0.330306 0.084486
H  4.696477 0.080167 -1.614869
H  -1.084809 -0.786434 2.169122
H  -0.672099 -2.4554 2.592632
H  4.003128 2.023029 0.638714
H  5.557118 1.817578 -0.135106
H  4.568315 2.60036 -2.326348
H  4.428736 3.815499 -1.061913
H  3.023482 2.866775 -1.520892
elementType: Cl O N C H
totalener: -1328.99723769 hartree
nucrepener: 1982.29336373 hartree
electener: -3311.29060142 hartree
oneelecener: -5756.36150767 hartree
twoeener: 2445.07090625 hartree
cpcmener: -0.02542688 hartree
kineticenergy: 1324.24462695 hartree
xcener: -107.419568668712 hartree
chargesum: -0.0000000
charge: -0.157337 -0.361256 -0.501805 0.028906 0.063743 -0.094791 -0.128020 -0.031867 -0.164331 -0.193777 -0.005946 -0.094367 -0.094841 0.295494 -0.190283 -0.275862 -0.252785 0.012427 -0.058544 -0.131337 -0.251856 0.109177 0.106354 0.086927 0.093722 0.091790 0.092559 0.086675 0.094380 0.143890 0.144033 0.154938 0.089229 0.084582 0.095921 0.095105 0.080477 0.086861 0.090196 0.084095 0.137007 0.152352 0.065131 0.077509 0.078960 0.090018 0.076550
qa: -0.1573 -0.3613 -0.5018 0.0289 0.0637 -0.0948 -0.1280 -0.0319 -0.1643 -0.1938 -0.0059 -0.0944 -0.0948 0.2955 -0.1903 -0.2759 -0.2528 0.0124 -0.0585 -0.1313 -0.2519 0.1092 0.1064 0.0869 0.0937 0.0918 0.0926 0.0867 0.0944 0.1439 0.1440 0.1549 0.0892 0.0846 0.0959 0.0951 0.0805 0.0869 0.0902 0.0841 0.1370 0.1524 0.0651 0.0775 0.0790 0.0900 0.0765
va: 1.1224 1.9388 2.0082 2.9847 3.7817 3.7373 3.7371 3.8418 3.8584 3.9182 3.9345 3.8149 3.8151 4.1182 3.9846 3.9353 3.9222 3.8842 3.9699 3.9287 3.9172 1.0168 1.0108 1.0081 0.9984 1.0056 0.9998 1.0067 0.9981 0.9969 0.9963 0.9933 0.9996 1.0098 1.0040 1.0047 1.0060 1.0041 0.9959 0.9932 1.0247 1.0071 1.0074 1.0132 1.0031 1.0052 1.0118
dispcorr: -0.027188668 hartree
energy: -1329.024426355975
dipole: 19.85012 -19.18770 0.66242 18.12923 -16.50979 1.61944 -6.85974 6.68260 -0.17714
magnitude: 1.75863 au
magnitude: 4.47008 debye
