program: Orca
programVersion: 5.0.2
elementType: Cl O O N C C C C C C C C C C C C C C C C C H H H H H H H H H H H H H H H H H H H H H H H H H H
charge: 0
multiplicity: 1
keywords: wb97x-d3
keywords: def2-TZVPP
keywords: def2/J RIJCOSX
keywords: DEFGRID2
keywords: scfconv7
keywords: smallprint printgap noloewdin
keywords: NOSOSCF
formula: C17H26ClNO2
InChI: InChI=1/C17H26ClNO2/c1-4-11-21-12-10-19(16(20)13-18)17-14(5-2)8-7-9-15(17)6-3/h7-9H,4-6,10-13H2,1-3H3
47 atoms
Cl -2.560556 -1.985857 2.594078
O  2.276258 0.068195 -1.34633
O  -0.488629 -3.426739 0.672085
N  0.051584 -1.282785 0.238985
C  -0.348571 0.075358 0.050279
C  -0.749423 0.487297 -1.225858
C  -0.328959 0.960335 1.134351
C  1.449714 -1.694041 0.05981
C  -0.783463 -0.444717 -2.406676
C  0.1109 0.543989 2.515524
C  2.427999 -0.556497 -0.097351
C  -1.151859 1.806481 -1.399528
C  -0.751936 2.27122 0.918973
C  -0.823479 -2.257051 0.564342
C  -1.159618 2.692769 -0.334248
C  -2.196023 -0.917734 -2.740164
C  1.175469 1.456142 3.117865
C  2.803487 1.374324 -1.379681
C  -2.266587 -1.867744 0.828145
C  2.61527 1.968319 -2.760263
C  3.15472 3.388815 -2.825744
H  1.758281 -2.265296 0.93684
H  1.529743 -2.365525 -0.798842
H  -0.14301 -1.310329 -2.244191
H  -0.373571 0.078786 -3.273486
H  -0.760978 0.533135 3.17498
H  0.484925 -0.479341 2.503866
H  2.319302 0.162066 0.72377
H  3.435839 -0.982486 0.001402
H  -1.460727 2.141891 -2.38289
H  -0.765484 2.971747 1.745151
H  -1.480599 3.716161 -0.482402
H  -2.186615 -1.562244 -3.619924
H  -2.859659 -0.078543 -2.951834
H  -2.635932 -1.488546 -1.921723
H  1.486136 1.081059 4.093554
H  0.813503 2.473863 3.263984
H  2.06345 1.509471 2.486159
H  2.301225 2.004081 -0.630232
H  3.872518 1.367279 -1.120793
H  -2.922346 -2.58654 0.34119
H  -2.542185 -0.865871 0.517713
H  3.122053 1.343218 -3.500398
H  1.551763 1.965258 -3.015596
H  3.015793 3.817865 -3.817967
H  4.222441 3.422825 -2.601264
H  2.647302 4.041076 -2.112642
elementType: Cl O N C H
totalener: -1328.99523085 hartree
nucrepener: 2009.00818567 hartree
electener: -3338.00341652 hartree
oneelecener: -5809.15424994 hartree
twoeener: 2471.15083342 hartree
cpcmener: -0.02760020 hartree
kineticenergy: 1324.25480206 hartree
xcener: -107.422176700508 hartree
chargesum: -0.0000000
charge: -0.161550 -0.360300 -0.507511 0.009937 0.089046 -0.123103 -0.094679 -0.057080 -0.161650 -0.174148 -0.012717 -0.100493 -0.096133 0.320659 -0.170571 -0.271248 -0.265330 0.020780 -0.091683 -0.083650 -0.277980 0.109699 0.108001 0.083631 0.082978 0.085224 0.086532 0.089791 0.106906 0.138639 0.138983 0.155106 0.097055 0.087087 0.086164 0.095810 0.088373 0.085456 0.067533 0.095138 0.157258 0.143608 0.067779 0.055264 0.094021 0.082236 0.081135
qa: -0.1616 -0.3603 -0.5075 0.0099 0.0890 -0.1231 -0.0947 -0.0571 -0.1617 -0.1741 -0.0127 -0.1005 -0.0961 0.3207 -0.1706 -0.2712 -0.2653 0.0208 -0.0917 -0.0836 -0.2780 0.1097 0.1080 0.0836 0.0830 0.0852 0.0865 0.0898 0.1069 0.1386 0.1390 0.1551 0.0971 0.0871 0.0862 0.0958 0.0884 0.0855 0.0675 0.0951 0.1573 0.1436 0.0678 0.0553 0.0940 0.0822 0.0811
va: 1.1140 1.9480 2.0166 2.9849 3.5532 3.7908 3.7452 3.8236 3.8824 3.8584 4.0118 3.7559 3.8147 4.0814 3.9406 3.9320 3.9354 3.8987 3.9793 3.8879 3.9586 1.0122 1.0096 1.0117 1.0042 1.0130 1.0090 0.9864 1.0038 0.9991 0.9999 0.9910 1.0045 1.0025 1.0034 1.0046 1.0031 1.0007 0.9856 0.9967 1.0022 1.0063 1.0126 1.0126 1.0032 1.0026 1.0010
dispcorr: -0.029419833 hartree
energy: -1329.024650684300
dipole: 19.43040 -18.78608 0.64432 20.97178 -18.54854 2.42324 -17.11240 16.34478 -0.76762
magnitude: 2.62231 au
magnitude: 6.66538 debye
