program: Orca
programVersion: 5.0.2
elementType: Cl O O N C C C C C C C C C C C C C C C C C H H H H H H H H H H H H H H H H H H H H H H H H H H
charge: 0
multiplicity: 1
keywords: wb97x-d3
keywords: def2-TZVPP
keywords: def2/J RIJCOSX
keywords: DEFGRID2
keywords: scfconv7
keywords: smallprint printgap noloewdin
keywords: NOSOSCF
formula: C17H26ClNO2
InChI: InChI=1/C17H26ClNO2/c1-4-11-21-12-10-19(16(20)13-18)17-14(5-2)8-7-9-15(17)6-3/h7-9H,4-6,10-13H2,1-3H3
47 atoms
Cl -2.807511 -2.366768 1.323917
O  3.515274 -0.232313 -0.613133
O  0.586657 -2.574341 1.370877
N  -0.032035 -0.616026 0.436881
C  -1.026562 0.391572 0.242826
C  -1.940773 0.237586 -0.809059
C  -1.06164 1.513712 1.079544
C  1.131809 -0.625759 -0.446413
C  -1.903403 -0.923369 -1.76754
C  -0.062797 1.753537 2.180281
C  2.434338 -0.298204 0.28406
C  -2.911312 1.218077 -0.990778
C  -2.057096 2.464724 0.86844
C  -0.200065 -1.643903 1.29794
C  -2.977252 2.32037 -0.155434
C  -1.367219 -0.527762 -3.141409
C  0.911362 2.874977 1.826725
C  3.696008 1.02529 -1.23081
C  -1.426081 -1.626583 2.191954
C  4.909687 0.964052 -2.134835
C  4.778096 -0.036043 -3.273541
H  1.217729 -1.596033 -0.941996
H  0.9501 0.116703 -1.222565
H  -2.917923 -1.311586 -1.883987
H  -1.311489 -1.746859 -1.369646
H  -0.598211 2.022674 3.094207
H  0.495686 0.846747 2.411611
H  2.326246 0.638935 0.843236
H  2.667676 -1.081319 1.006753
H  -3.632274 1.106867 -1.792504
H  -2.109723 3.329141 1.520174
H  -3.748041 3.06636 -0.301887
H  -1.982661 0.245639 -3.60341
H  -1.361652 -1.387821 -3.812623
H  -0.346695 -0.147343 -3.084567
H  1.439719 2.668717 0.894486
H  1.658212 3.000601 2.611797
H  0.395187 3.828273 1.705435
H  2.813255 1.315406 -1.817862
H  3.839259 1.802623 -0.467288
H  -1.730744 -0.635672 2.516356
H  -1.226017 -2.240453 3.065937
H  5.063676 1.967066 -2.541421
H  5.79669 0.738478 -1.535888
H  4.67478 -1.058659 -2.910453
H  5.65613 -0.00929 -3.919898
H  3.907949 0.184148 -3.895152
elementType: Cl O N C H
totalener: -1328.99599558 hartree
nucrepener: 1953.13756787 hartree
electener: -3282.13356346 hartree
oneelecener: -5697.18540971 hartree
twoeener: 2415.05184626 hartree
cpcmener: -0.02813754 hartree
kineticenergy: 1324.24278484 hartree
xcener: -107.416452837531 hartree
chargesum: 0.0000000
charge: -0.154335 -0.383583 -0.498733 0.011284 0.134282 -0.166805 -0.148382 -0.049715 -0.149854 -0.186979 -0.010680 -0.063937 -0.071480 0.285178 -0.201978 -0.265706 -0.266967 0.023756 -0.058237 -0.100120 -0.257086 0.108198 0.113855 0.093253 0.073774 0.097587 0.084173 0.096315 0.110277 0.141264 0.141656 0.154742 0.086309 0.095916 0.086033 0.076544 0.100797 0.094973 0.080433 0.086238 0.140345 0.148647 0.061455 0.061067 0.078659 0.091338 0.076233
qa: -0.1543 -0.3836 -0.4987 0.0113 0.1343 -0.1668 -0.1484 -0.0497 -0.1499 -0.1870 -0.0107 -0.0639 -0.0715 0.2852 -0.2020 -0.2657 -0.2670 0.0238 -0.0582 -0.1001 -0.2571 0.1082 0.1139 0.0933 0.0738 0.0976 0.0842 0.0963 0.1103 0.1413 0.1417 0.1547 0.0863 0.0959 0.0860 0.0765 0.1008 0.0950 0.0804 0.0862 0.1403 0.1486 0.0615 0.0611 0.0787 0.0913 0.0762
va: 1.1189 1.9507 2.0092 2.9611 3.5849 3.7608 3.7624 3.7057 3.8794 3.8760 3.9612 3.8023 3.7984 4.1482 3.9826 3.9284 3.9082 3.8954 3.9664 3.9213 3.9141 1.0201 0.9881 1.0008 1.0159 1.0013 1.0132 0.9992 1.0190 0.9979 0.9972 0.9922 1.0035 1.0045 1.0007 1.0042 1.0040 1.0048 0.9800 0.9979 1.0108 1.0100 1.0118 1.0152 1.0144 1.0043 1.0033
dispcorr: -0.026708296 hartree
energy: -1329.022703879223
dipole: 24.49148 -25.04892 -0.55743 18.75696 -16.08674 2.67022 -16.37704 16.22528 -0.15177
magnitude: 2.73200 au
magnitude: 6.94420 debye
