program: Orca
programVersion: 5.0.2
elementType: Cl O O N C C C C C C C C C C C C C C C C C H H H H H H H H H H H H H H H H H H H H H H H H H H
charge: 0
multiplicity: 1
keywords: wb97x-d3
keywords: def2-TZVPP
keywords: def2/J RIJCOSX
keywords: DEFGRID2
keywords: scfconv7
keywords: smallprint printgap noloewdin
keywords: NOSOSCF
formula: C17H26ClNO2
InChI: InChI=1/C17H26ClNO2/c1-4-11-21-12-10-19(16(20)13-18)17-14(5-2)8-7-9-15(17)6-3/h7-9H,4-6,10-13H2,1-3H3
47 atoms
Cl -0.724239 -2.809446 2.742823
O  2.16654 -0.30102 -1.643625
O  1.38171 -1.232968 1.57784
N  0.166686 0.35019 0.509025
C  -1.111475 0.856786 0.125047
C  -1.7608 0.347287 -1.008493
C  -1.686487 1.878969 0.8956
C  1.33953 1.147768 0.167108
C  -1.209785 -0.783426 -1.839839
C  -1.040228 2.428113 2.140721
C  1.797383 0.999746 -1.274324
C  -2.995189 0.889818 -1.359749
C  -2.916231 2.395359 0.501937
C  0.304347 -0.777934 1.244228
C  -3.566736 1.908973 -0.619454
C  -1.047699 -0.435346 -3.316378
C  -0.605123 3.884093 1.994157
C  3.442487 -0.71366 -1.196722
C  -1.007902 -1.436796 1.651167
C  3.760254 -2.068824 -1.79406
C  3.81331 -2.070855 -3.314745
H  1.09723 2.201066 0.320782
H  2.141513 0.908528 0.863904
H  -1.888135 -1.637369 -1.752068
H  -0.251556 -1.120401 -1.450969
H  -1.760103 2.358397 2.960492
H  -0.185951 1.821349 2.440745
H  0.990933 1.3039 -1.945999
H  2.623133 1.707237 -1.433964
H  -3.519216 0.501022 -2.22453
H  -3.376437 3.178917 1.092635
H  -4.527192 2.316397 -0.908666
H  -0.624019 -1.281059 -3.859316
H  -0.381676 0.416132 -3.458626
H  -1.99967 -0.191151 -3.788098
H  -0.13483 4.237109 2.912718
H  -1.45315 4.5377 1.786419
H  0.114637 4.010661 1.184376
H  4.203438 0.018845 -1.502365
H  3.480719 -0.776209 -0.103439
H  -1.545831 -1.812475 0.781337
H  -1.658607 -0.730414 2.165163
H  4.725605 -2.384056 -1.390207
H  3.0288 -2.801417 -1.440247
H  2.84953 -1.816801 -3.75663
H  4.095527 -3.053215 -3.695119
H  4.547871 -1.353117 -3.686164
elementType: Cl O N C H
totalener: -1328.99895591 hartree
nucrepener: 1960.84352688 hartree
electener: -3289.84248278 hartree
oneelecener: -5713.23818730 hartree
twoeener: 2423.39570451 hartree
cpcmener: -0.02857605 hartree
kineticenergy: 1324.24896686 hartree
xcener: -107.422151797703 hartree
chargesum: -0.0000000
charge: -0.152705 -0.375273 -0.486912 0.023437 0.105229 -0.148158 -0.146610 -0.065015 -0.182704 -0.173858 -0.007002 -0.083513 -0.068956 0.289447 -0.196773 -0.277506 -0.257056 0.009928 -0.076448 -0.100644 -0.257471 0.125477 0.111257 0.103059 0.080335 0.094182 0.085459 0.110642 0.104155 0.141624 0.141032 0.155459 0.096862 0.087191 0.091302 0.095165 0.086452 0.084426 0.082309 0.088411 0.147496 0.148120 0.064725 0.060748 0.076951 0.089870 0.075856
qa: -0.1527 -0.3753 -0.4869 0.0234 0.1052 -0.1482 -0.1466 -0.0650 -0.1827 -0.1739 -0.0070 -0.0835 -0.0690 0.2894 -0.1968 -0.2775 -0.2571 0.0099 -0.0764 -0.1006 -0.2575 0.1255 0.1113 0.1031 0.0803 0.0942 0.0855 0.1106 0.1042 0.1416 0.1410 0.1555 0.0969 0.0872 0.0913 0.0952 0.0865 0.0844 0.0823 0.0884 0.1475 0.1481 0.0647 0.0607 0.0770 0.0899 0.0759
va: 1.1271 1.9092 2.0231 2.9652 3.6351 3.7693 3.8112 3.7603 3.8302 3.8854 3.8921 3.8013 3.7978 4.1336 3.9766 3.9265 3.9152 3.8804 4.0087 3.9118 3.9246 1.0109 1.0180 0.9981 1.0460 1.0004 1.0119 0.9857 1.0062 0.9986 0.9981 0.9926 1.0035 1.0036 1.0054 1.0046 1.0037 1.0035 0.9958 1.0059 1.0055 1.0021 1.0128 1.0139 1.0104 1.0052 1.0025
dispcorr: -0.026556381 hartree
energy: -1329.025512288631
dipole: 11.69081 -12.73187 -1.04107 14.18262 -11.91849 2.26413 -22.27492 21.35639 -0.91853
magnitude: 2.65590 au
magnitude: 6.75077 debye
