program: Orca
programVersion: 5.0.2
elementType: Cl O O N C C C C C C C C C C C C C C C C C H H H H H H H H H H H H H H H H H H H H H H H H H H
charge: 0
multiplicity: 1
keywords: wb97x-d3
keywords: def2-TZVPP
keywords: def2/J RIJCOSX
keywords: DEFGRID2
keywords: scfconv7
keywords: smallprint printgap noloewdin
keywords: NOSOSCF
formula: C17H26ClNO2
InChI: InChI=1/C17H26ClNO2/c1-4-11-21-12-10-19(16(20)13-18)17-14(5-2)8-7-9-15(17)6-3/h7-9H,4-6,10-13H2,1-3H3
47 atoms
Cl -1.737741 -2.446855 3.209223
O  2.495075 0.30747 -0.777114
O  0.111217 -3.078539 1.024674
N  -0.095138 -1.138719 -0.115268
C  -0.64974 0.172898 -0.214501
C  -1.608343 0.431672 -1.202567
C  -0.21568 1.178251 0.662922
C  0.900533 -1.539735 -1.104146
C  -2.125679 -0.629085 -2.139326
C  0.767683 0.942357 1.781319
C  2.319929 -1.08534 -0.810633
C  -2.10913 1.725443 -1.319593
C  -0.743256 2.456974 0.507855
C  -0.466351 -2.023458 0.84064
C  -1.677083 2.734178 -0.476473
C  -1.707255 -0.397588 -3.589156
C  0.156973 1.147257 3.166299
C  2.389186 0.954784 -2.025122
C  -1.7295 -1.673429 1.606793
C  2.717954 2.423631 -1.855004
C  4.126586 2.685596 -1.34459
H  0.903489 -2.626883 -1.178712
H  0.579425 -1.170583 -2.078231
H  -3.217561 -0.634346 -2.085952
H  -1.80668 -1.621243 -1.819444
H  1.194834 -0.057246 1.726937
H  1.605432 1.633517 1.661709
H  2.637853 -1.46754 0.161837
H  2.973494 -1.543419 -1.567417
H  -2.856022 1.938936 -2.075521
H  -0.413064 3.249195 1.169772
H  -2.074058 3.736077 -0.580521
H  -2.092132 -1.190498 -4.23165
H  -0.621882 -0.379753 -3.699352
H  -2.090502 0.549686 -3.97035
H  -0.664333 0.455649 3.357149
H  -0.225978 2.160123 3.296864
H  0.908607 0.979597 3.938869
H  3.077421 0.49602 -2.750972
H  1.378159 0.859616 -2.442746
H  -2.582389 -2.057367 1.043151
H  -1.88486 -0.609626 1.751607
H  2.584133 2.898735 -2.830306
H  1.982416 2.885804 -1.189617
H  4.874813 2.21816 -1.988383
H  4.27356 2.303412 -0.334135
H  4.339519 3.755126 -1.320761
elementType: Cl O N C H
totalener: -1328.99588135 hartree
nucrepener: 1999.19297829 hartree
electener: -3328.18885964 hartree
oneelecener: -5789.52923435 hartree
twoeener: 2461.34037471 hartree
cpcmener: -0.02844857 hartree
kineticenergy: 1324.25458220 hartree
xcener: -107.424042660414 hartree
chargesum: 0.0000000
charge: -0.155665 -0.371627 -0.491280 0.011445 0.142324 -0.131420 -0.171822 -0.099660 -0.166197 -0.139883 0.013122 -0.069512 -0.093850 0.309241 -0.192293 -0.263131 -0.263650 0.018072 -0.101772 -0.108867 -0.261205 0.103342 0.124698 0.093676 0.083735 0.076774 0.086321 0.099566 0.096541 0.140456 0.140692 0.155124 0.098825 0.081413 0.087946 0.074465 0.086610 0.097071 0.093334 0.080738 0.160795 0.148180 0.071524 0.058499 0.078642 0.078426 0.090236
qa: -0.1557 -0.3716 -0.4913 0.0114 0.1423 -0.1314 -0.1718 -0.0997 -0.1662 -0.1399 0.0131 -0.0695 -0.0938 0.3092 -0.1923 -0.2631 -0.2636 0.0181 -0.1018 -0.1089 -0.2612 0.1033 0.1247 0.0937 0.0837 0.0768 0.0863 0.0996 0.0965 0.1405 0.1407 0.1551 0.0988 0.0814 0.0879 0.0745 0.0866 0.0971 0.0933 0.0807 0.1608 0.1482 0.0715 0.0585 0.0786 0.0784 0.0902
va: 1.1198 1.9168 2.0235 2.9824 3.5143 3.7945 3.7400 3.7863 3.8711 3.8743 3.8857 3.7955 3.7696 4.1267 3.9689 3.9178 3.9264 3.8983 4.0057 3.9075 3.9309 1.0408 0.9924 1.0011 1.0131 1.0142 1.0064 1.0046 1.0055 0.9975 0.9978 0.9916 1.0057 1.0031 1.0033 1.0127 1.0058 1.0039 0.9978 0.9877 0.9998 0.9920 1.0124 1.0128 1.0024 1.0111 1.0050
dispcorr: -0.028987018 hartree
energy: -1329.024868368077
dipole: 14.67403 -15.28044 -0.60641 20.14480 -18.30850 1.83630 -21.79378 19.53925 -2.25452
magnitude: 2.97029 au
magnitude: 7.54987 debye
