program: Orca
programVersion: 5.0.2
elementType: Cl O O N C C C C C C C C C C C C C C C C C H H H H H H H H H H H H H H H H H H H H H H H H H H
charge: 0
multiplicity: 1
keywords: wb97x-d3
keywords: def2-TZVPP
keywords: def2/J RIJCOSX
keywords: DEFGRID2
keywords: scfconv7
keywords: smallprint printgap noloewdin
keywords: NOSOSCF
formula: C17H26ClNO2
InChI: InChI=1/C17H26ClNO2/c1-4-11-21-12-10-19(16(20)13-18)17-14(5-2)8-7-9-15(17)6-3/h7-9H,4-6,10-13H2,1-3H3
47 atoms
Cl -2.586314 -2.217141 1.355259
O  2.371806 0.711035 -1.275505
O  0.68707 -2.848778 0.550883
N  0.004822 -0.863001 -0.277107
C  -0.793685 0.31697 -0.178377
C  -1.95629 0.395598 -0.96267
C  -0.389494 1.377094 0.643995
C  0.79414 -1.061773 -1.492186
C  -2.386064 -0.742529 -1.855192
C  0.844327 1.336886 1.512188
C  2.256336 -0.6873 -1.370343
C  -2.699138 1.570363 -0.921963
C  -1.17001 2.531763 0.654205
C  -0.002954 -1.846125 0.64969
C  -2.30848 2.632644 -0.123329
C  -3.89286 -0.928874 -1.973582
C  0.57569 1.66844 2.977208
C  3.69501 1.198707 -1.321706
C  -0.939193 -1.695363 1.83438
C  4.523445 0.913857 -0.078438
C  5.884517 1.588519 -0.163227
H  0.727999 -2.107309 -1.794276
H  0.341763 -0.474012 -2.291093
H  -1.950391 -1.676145 -1.500637
H  -1.968534 -0.583415 -2.855112
H  1.332783 0.365699 1.451735
H  1.567086 2.056038 1.118327
H  2.708139 -1.198927 -0.513238
H  2.771323 -1.056722 -2.269153
H  -3.596077 1.663077 -1.520314
H  -0.872625 3.370192 1.272163
H  -2.895565 3.542163 -0.108374
H  -4.38151 -0.100224 -2.486019
H  -4.359568 -1.040285 -0.994312
H  -4.110339 -1.829819 -2.548272
H  1.49381 1.571229 3.558074
H  -0.164703 0.999367 3.418675
H  0.217197 2.689276 3.110292
H  4.214629 0.804945 -2.207894
H  3.609271 2.280151 -1.45911
H  -1.01715 -0.684357 2.221461
H  -0.605773 -2.356108 2.630441
H  3.988217 1.27316 0.805076
H  4.662068 -0.162439 0.052844
H  5.788666 2.67325 -0.241748
H  6.449862 1.244527 -1.031743
H  6.485215 1.376298 0.721473
elementType: Cl O N C H
totalener: -1328.99551986 hartree
nucrepener: 1977.36051918 hartree
electener: -3306.35603904 hartree
oneelecener: -5746.50292446 hartree
twoeener: 2440.14688542 hartree
cpcmener: -0.02593046 hartree
kineticenergy: 1324.23702533 hartree
xcener: -107.419871448583 hartree
chargesum: -0.0000000
charge: -0.157604 -0.362685 -0.502084 0.030116 0.091321 -0.104732 -0.139682 -0.031611 -0.180911 -0.193533 -0.012437 -0.085081 -0.087899 0.288048 -0.199971 -0.272108 -0.254268 -0.000619 -0.043094 -0.086968 -0.278173 0.106810 0.105949 0.088712 0.096261 0.090272 0.089317 0.092628 0.098407 0.143736 0.144164 0.154331 0.089339 0.082558 0.094996 0.095558 0.080670 0.087368 0.081187 0.094635 0.133800 0.148750 0.060639 0.065985 0.081846 0.083546 0.092512
qa: -0.1576 -0.3627 -0.5021 0.0301 0.0913 -0.1047 -0.1397 -0.0316 -0.1809 -0.1935 -0.0124 -0.0851 -0.0879 0.2880 -0.2000 -0.2721 -0.2543 -0.0006 -0.0431 -0.0870 -0.2782 0.1068 0.1059 0.0887 0.0963 0.0903 0.0893 0.0926 0.0984 0.1437 0.1442 0.1543 0.0893 0.0826 0.0950 0.0956 0.0807 0.0874 0.0812 0.0946 0.1338 0.1487 0.0606 0.0660 0.0818 0.0835 0.0925
va: 1.1227 1.9429 2.0034 2.9793 3.7480 3.7323 3.7321 3.8190 3.8632 3.9149 3.9444 3.8026 3.8070 4.1265 3.9921 3.9347 3.9223 3.9073 3.9677 3.8444 3.9645 1.0228 1.0139 1.0084 0.9984 0.9981 1.0029 0.9976 1.0009 0.9964 0.9960 0.9938 1.0000 1.0103 1.0042 1.0041 1.0048 1.0038 1.0002 0.9981 1.0246 1.0100 1.0082 1.0090 1.0018 1.0017 1.0015
dispcorr: -0.027125087 hartree
energy: -1329.022644943635
dipole: 22.51438 -21.86660 0.64777 15.48114 -13.88343 1.59770 -5.30228 5.01995 -0.28233
magnitude: 1.74699 au
magnitude: 4.44050 debye
