program: Orca
programVersion: 5.0.2
elementType: Cl O O N C C C C C C C C C C C C C C C C C H H H H H H H H H H H H H H H H H H H H H H H H H H
charge: 0
multiplicity: 1
keywords: wb97x-d3
keywords: def2-TZVPP
keywords: def2/J RIJCOSX
keywords: DEFGRID2
keywords: scfconv7
keywords: smallprint printgap noloewdin
keywords: NOSOSCF
formula: C17H26ClNO2
InChI: InChI=1/C17H26ClNO2/c1-4-11-21-12-10-19(16(20)13-18)17-14(5-2)8-7-9-15(17)6-3/h7-9H,4-6,10-13H2,1-3H3
47 atoms
Cl -1.992449 -1.61292 2.628302
O  3.0477 0.412557 -1.71564
O  0.83339 -2.349667 0.810252
N  -0.033523 -0.35245 0.223412
C  -1.153969 0.510591 0.023746
C  -1.904234 0.428587 -1.158708
C  -1.43833 1.471022 1.004933
C  1.296824 0.189634 -0.036709
C  -1.631972 -0.584827 -2.243524
C  -0.638022 1.617294 2.273228
C  1.778226 -0.128458 -1.450833
C  -2.948982 1.332719 -1.336169
C  -2.497828 2.346274 0.787256
C  -0.139055 -1.627667 0.655938
C  -3.246272 2.282956 -0.375155
C  -2.858738 -1.396469 -2.64862
C  0.164928 2.915351 2.315154
C  4.128965 -0.297477 -1.145465
C  -1.52437 -2.15147 0.984556
C  5.425471 0.206558 -1.744822
C  6.629063 -0.507823 -1.149958
H  1.25344 1.271168 0.091139
H  1.989029 -0.195787 0.712436
H  -0.841628 -1.272079 -1.94488
H  -1.248608 -0.059186 -3.123502
H  -1.327294 1.60188 3.121141
H  0.031267 0.769938 2.41701
H  1.771836 -1.213382 -1.619159
H  1.093889 0.319959 -2.174853
H  -3.536147 1.297099 -2.245546
H  -2.737847 3.086758 1.541441
H  -4.06383 2.974769 -0.533325
H  -3.645666 -0.774228 -3.075049
H  -3.284278 -1.93377 -1.799403
H  -2.587442 -2.135443 -3.403902
H  0.730264 2.985325 3.245673
H  -0.481696 3.791901 2.258621
H  0.876863 2.977172 1.491057
H  4.156226 -0.173422 -0.054607
H  4.021175 -1.374308 -1.339625
H  -1.492663 -3.238042 0.992506
H  -2.299811 -1.824128 0.297091
H  5.405849 0.060521 -2.828296
H  5.512897 1.282845 -1.572038
H  6.697689 -0.34938 -0.072061
H  7.557637 -0.146929 -1.593134
H  6.582054 -1.584782 -1.322272
elementType: Cl O N C H
totalener: -1328.99609094 hartree
nucrepener: 1930.19821558 hartree
electener: -3259.19430652 hartree
oneelecener: -5651.44120285 hartree
twoeener: 2392.24689633 hartree
cpcmener: -0.02688158 hartree
kineticenergy: 1324.23226506 hartree
xcener: -107.415878655187 hartree
chargesum: 0.0000000
charge: -0.157086 -0.384808 -0.499460 0.013283 0.102709 -0.134267 -0.154926 -0.025300 -0.196650 -0.170537 -0.022562 -0.074120 -0.068771 0.286965 -0.202187 -0.257499 -0.259720 0.044492 -0.041045 -0.075009 -0.277025 0.111808 0.113204 0.086656 0.099926 0.092683 0.076664 0.100193 0.109233 0.144865 0.140131 0.155163 0.087719 0.081820 0.095198 0.094704 0.085537 0.086016 0.070183 0.071496 0.148455 0.132599 0.057382 0.058780 0.080457 0.092312 0.080342
qa: -0.1571 -0.3848 -0.4995 0.0133 0.1027 -0.1343 -0.1549 -0.0253 -0.1966 -0.1705 -0.0226 -0.0741 -0.0688 0.2870 -0.2022 -0.2575 -0.2597 0.0445 -0.0410 -0.0750 -0.2770 0.1118 0.1132 0.0867 0.0999 0.0927 0.0767 0.1002 0.1092 0.1449 0.1401 0.1552 0.0877 0.0818 0.0952 0.0947 0.0855 0.0860 0.0702 0.0715 0.1485 0.1326 0.0574 0.0588 0.0805 0.0923 0.0803
va: 1.1188 1.9594 2.0098 2.9724 3.6962 3.7538 3.7759 3.6321 3.8940 3.8927 3.9730 3.7938 3.7999 4.1474 3.9811 3.9265 3.9278 3.8981 3.9600 3.8917 3.9557 1.0137 1.0155 1.0050 0.9972 1.0019 1.0153 1.0078 0.9972 0.9958 0.9985 0.9927 1.0041 1.0041 1.0044 1.0044 1.0041 1.0016 0.9846 0.9924 1.0092 1.0225 1.0138 1.0124 1.0016 1.0034 1.0014
dispcorr: -0.025596581 hartree
energy: -1329.021687520182
dipole: 21.28137 -22.16885 -0.88748 8.45879 -7.61621 0.84258 -15.75692 14.87817 -0.87876
magnitude: 1.50657 au
magnitude: 3.82941 debye
