program: Orca
programVersion: 5.0.2
elementType: Cl O O N C C C C C C C C C C C C C C C C C H H H H H H H H H H H H H H H H H H H H H H H H H H
charge: 0
multiplicity: 1
keywords: wb97x-d3
keywords: def2-TZVPP
keywords: def2/J RIJCOSX
keywords: DEFGRID2
keywords: scfconv7
keywords: smallprint printgap noloewdin
keywords: NOSOSCF
formula: C17H26ClNO2
InChI: InChI=1/C17H26ClNO2/c1-4-11-21-12-10-19(16(20)13-18)17-14(5-2)8-7-9-15(17)6-3/h7-9H,4-6,10-13H2,1-3H3
47 atoms
Cl -2.325735 -1.569614 2.791457
O  2.210545 0.395125 -0.859737
O  -0.288634 -3.55248 1.030095
N  0.03044 -1.434156 0.297496
C  -0.471851 -0.104365 0.152064
C  -1.160749 0.2462 -1.017814
C  -0.246546 0.822946 1.175955
C  1.443525 -1.701877 0.021874
C  -1.470695 -0.750772 -2.107354
C  0.498191 0.493647 2.443392
C  2.00833 -0.958096 -1.168911
C  -1.61604 1.555934 -1.144543
C  -0.718531 2.120819 1.005433
C  -0.72604 -2.436133 0.799814
C  -1.394589 2.488465 -0.145138
C  -1.1246 -0.27067 -3.512578
C  1.857143 1.183401 2.533656
C  2.523463 1.202055 -1.97004
C  -2.183773 -2.133955 1.09534
C  2.597326 2.647502 -1.523166
C  2.874931 3.585367 -2.687308
H  2.05016 -1.496153 0.909338
H  1.544993 -2.76532 -0.186435
H  -2.539495 -0.985813 -2.068377
H  -0.955819 -1.692128 -1.918963
H  -0.113215 0.810159 3.291676
H  0.628695 -0.581857 2.556735
H  2.959646 -1.441365 -1.432138
H  1.349582 -1.076381 -2.038889
H  -2.164129 1.849434 -2.031402
H  -0.557338 2.850763 1.790307
H  -1.758715 3.501673 -0.260195
H  -1.336423 -1.054623 -4.240496
H  -0.067449 -0.015487 -3.599191
H  -1.701354 0.606376 -3.80647
H  1.760748 2.268293 2.472049
H  2.525544 0.866313 1.735353
H  2.338811 0.951307 3.483874
H  3.478243 0.892905 -2.420614
H  1.756281 1.092622 -2.750264
H  -2.754705 -3.055201 1.008046
H  -2.632936 -1.376389 0.461209
H  1.651386 2.922072 -1.047532
H  3.376927 2.754748 -0.763793
H  3.820984 3.350006 -3.178519
H  2.930826 4.620972 -2.350757
H  2.087859 3.529297 -3.441634
elementType: Cl O N C H
totalener: -1328.99447944 hartree
nucrepener: 2021.18698611 hartree
electener: -3350.18146554 hartree
oneelecener: -5833.98370117 hartree
twoeener: 2483.80223563 hartree
cpcmener: -0.02703559 hartree
kineticenergy: 1324.25521643 hartree
xcener: -107.423585272604 hartree
chargesum: 0.0000000
charge: -0.156574 -0.345640 -0.503839 0.002765 0.106363 -0.090693 -0.144047 -0.059598 -0.168545 -0.153256 -0.028323 -0.078162 -0.088060 0.289949 -0.202106 -0.274060 -0.273645 0.010540 -0.057654 -0.075577 -0.278963 0.113716 0.111327 0.096629 0.088419 0.091127 0.072774 0.111623 0.099312 0.139600 0.136459 0.152991 0.099376 0.084984 0.090229 0.087443 0.071786 0.098968 0.089453 0.069781 0.149123 0.138277 0.050320 0.068043 0.082478 0.093470 0.081417
qa: -0.1566 -0.3456 -0.5038 0.0028 0.1064 -0.0907 -0.1440 -0.0596 -0.1685 -0.1533 -0.0283 -0.0782 -0.0881 0.2899 -0.2021 -0.2741 -0.2736 0.0105 -0.0577 -0.0756 -0.2790 0.1137 0.1113 0.0966 0.0884 0.0911 0.0728 0.1116 0.0993 0.1396 0.1365 0.1530 0.0994 0.0850 0.0902 0.0874 0.0718 0.0990 0.0895 0.0698 0.1491 0.1383 0.0503 0.0680 0.0825 0.0935 0.0814
va: 1.1185 1.9465 2.0090 2.9903 3.5662 3.7089 3.7407 3.8300 3.8581 3.8598 3.9557 3.7889 3.7836 4.1326 3.9498 3.9386 3.9131 3.9101 3.9640 3.8889 3.9694 1.0007 1.0304 0.9976 1.0097 1.0026 1.0158 1.0016 0.9811 0.9988 0.9999 0.9936 1.0050 0.9966 1.0024 1.0033 1.0313 1.0060 0.9972 0.9773 1.0090 1.0145 1.0153 1.0106 1.0022 1.0029 1.0006
dispcorr: -0.029691626 hartree
energy: -1329.024171061734
dipole: 19.82184 -19.71706 0.10479 19.25564 -17.75405 1.50158 -23.32204 21.29837 -2.02367
magnitude: 2.52210 au
magnitude: 6.41066 debye
