program: Orca
programVersion: 5.0.2
elementType: Cl O O N C C C C C C C C C C C C C C C C C H H H H H H H H H H H H H H H H H H H H H H H H H H
charge: 0
multiplicity: 1
keywords: wb97x-d3
keywords: def2-TZVPP
keywords: def2/J RIJCOSX
keywords: DEFGRID2
keywords: scfconv7
keywords: smallprint printgap noloewdin
keywords: NOSOSCF
formula: C17H26ClNO2
InChI: InChI=1/C17H26ClNO2/c1-4-11-21-12-10-19(16(20)13-18)17-14(5-2)8-7-9-15(17)6-3/h7-9H,4-6,10-13H2,1-3H3
47 atoms
Cl -2.072491 -1.317439 2.825747
O  2.147014 0.360956 -1.195632
O  -0.205721 -3.491184 1.02486
N  0.070112 -1.409837 0.179618
C  -0.434346 -0.081146 0.023193
C  -1.255403 0.221736 -1.067412
C  -0.069173 0.891679 0.967091
C  1.454168 -1.711612 -0.19407
C  -1.685636 -0.807592 -2.082735
C  0.860873 0.557676 2.105461
C  1.940202 -1.004256 -1.438448
C  -1.728237 1.527995 -1.191394
C  -0.560345 2.180677 0.801231
C  -0.652439 -2.380722 0.784227
C  -1.383911 2.497741 -0.269254
C  -1.391333 -0.411043 -3.525421
C  0.73701 1.445954 3.334124
C  2.457434 1.100333 -2.353451
C  -2.078574 -2.052075 1.190257
C  2.41245 2.581284 -2.039563
C  3.372851 3.017344 -0.943709
H  2.130201 -1.506334 0.641445
H  1.518259 -2.780403 -0.392274
H  -2.762356 -0.973615 -1.975506
H  -1.21454 -1.768565 -1.878563
H  0.709465 -0.477625 2.412049
H  1.890061 0.605105 1.73489
H  2.87776 -1.492775 -1.740231
H  1.230595 -1.160733 -2.262111
H  -2.381614 1.784647 -2.016546
H  -0.303322 2.955048 1.511988
H  -1.762025 3.506609 -0.377654
H  -1.906832 0.50463 -3.816298
H  -1.718464 -1.197056 -4.20726
H  -0.323789 -0.25517 -3.687784
H  -0.283221 1.457398 3.720604
H  1.035083 2.476919 3.141375
H  1.385634 1.071447 4.126829
H  3.451877 0.822334 -2.734297
H  1.738555 0.874997 -3.154273
H  -2.642328 -2.979334 1.252531
H  -2.59627 -1.366458 0.52683
H  2.644846 3.11402 -2.965773
H  1.388859 2.862572 -1.774014
H  4.401862 2.73769 -1.178922
H  3.122121 2.575771 0.02146
H  3.34941 4.100581 -0.81749
elementType: Cl O N C H
totalener: -1328.99389489 hartree
nucrepener: 2030.02420695 hartree
electener: -3359.01810183 hartree
oneelecener: -5851.78192415 hartree
twoeener: 2492.76382231 hartree
cpcmener: -0.02655886 hartree
kineticenergy: 1324.24476070 hartree
xcener: -107.423012898283 hartree
chargesum: 0.0000000
charge: -0.155510 -0.351065 -0.501659 0.005449 0.141784 -0.116763 -0.157957 -0.055004 -0.178258 -0.163735 -0.025627 -0.070863 -0.096622 0.279303 -0.208643 -0.268806 -0.271347 0.002455 -0.051676 -0.109310 -0.257811 0.111725 0.109888 0.097363 0.090169 0.094739 0.083050 0.108776 0.098203 0.139127 0.141644 0.152274 0.089721 0.098137 0.081086 0.088486 0.085727 0.096571 0.089255 0.088994 0.148696 0.138195 0.075176 0.057253 0.081770 0.074198 0.091442
qa: -0.1555 -0.3511 -0.5017 0.0054 0.1418 -0.1168 -0.1580 -0.0550 -0.1783 -0.1637 -0.0256 -0.0709 -0.0966 0.2793 -0.2086 -0.2688 -0.2713 0.0025 -0.0517 -0.1093 -0.2578 0.1117 0.1099 0.0974 0.0902 0.0947 0.0831 0.1088 0.0982 0.1391 0.1416 0.1523 0.0897 0.0981 0.0811 0.0885 0.0857 0.0966 0.0893 0.0890 0.1487 0.1382 0.0752 0.0573 0.0818 0.0742 0.0914
va: 1.1216 1.9358 2.0098 2.9832 3.5356 3.7204 3.7044 3.8295 3.8545 3.8507 3.9641 3.7864 3.7518 4.1374 3.9691 3.9343 3.9392 3.8973 3.9608 3.9135 3.9283 1.0027 1.0281 0.9977 1.0119 1.0086 1.0084 1.0010 0.9808 0.9980 0.9966 0.9944 1.0032 1.0055 1.0006 1.0068 0.9990 1.0041 0.9966 0.9884 1.0104 1.0139 1.0150 1.0134 1.0033 1.0043 1.0046
dispcorr: -0.029678806 hartree
energy: -1329.023573691570
dipole: 17.03972 -17.01253 0.02719 16.98463 -15.66926 1.31538 -19.66963 17.58448 -2.08514
magnitude: 2.46552 au
magnitude: 6.26685 debye
