program: Orca
programVersion: 5.0.2
elementType: Cl O O N C C C C C C C C C C C C C C C C C H H H H H H H H H H H H H H H H H H H H H H H H H H
charge: 0
multiplicity: 1
keywords: wb97x-d3
keywords: def2-TZVPP
keywords: def2/J RIJCOSX
keywords: DEFGRID2
keywords: scfconv7
keywords: smallprint printgap noloewdin
keywords: NOSOSCF
formula: C17H26ClNO2
InChI: InChI=1/C17H26ClNO2/c1-4-11-21-12-10-19(16(20)13-18)17-14(5-2)8-7-9-15(17)6-3/h7-9H,4-6,10-13H2,1-3H3
47 atoms
Cl -0.430477 -1.543177 2.675481
O  2.53651 0.19287 -0.746387
O  0.230315 -2.841772 -0.490405
N  -0.335237 -0.652572 -0.522316
C  -1.327925 0.320336 -0.174745
C  -2.592822 0.230945 -0.778488
C  -1.032153 1.340376 0.736228
C  0.43651 -0.419325 -1.747747
C  -2.942666 -0.808479 -1.81199
C  0.319804 1.53416 1.365982
C  1.931672 -0.664682 -1.6780
C  -3.566982 1.158364 -0.425409
C  -2.039396 2.247683 1.06045
C  -0.39229 -1.906199 -0.015074
C  -3.297357 2.158928 0.493455
C  -2.909759 -0.242264 -3.229894
C  1.021463 2.783772 0.839654
C  3.918238 -0.043679 -0.598001
C  -1.26409 -2.140251 1.206749
C  4.5017 0.942866 0.392085
C  5.9879 0.701823 0.609562
H  0.042943 -1.039153 -2.559635
H  0.262904 0.617826 -2.033279
H  -3.948108 -1.182133 -1.604911
H  -2.285445 -1.676364 -1.756565
H  0.192355 1.625556 2.447117
H  0.951282 0.665487 1.203653
H  2.15366 -1.710196 -1.446775
H  2.320338 -0.47747 -2.689945
H  -4.551087 1.088875 -0.87451
H  -1.8299 3.030253 1.780498
H  -4.069565 2.865462 0.770444
H  -3.631259 0.567272 -3.349312
H  -3.155554 -1.015148 -3.959365
H  -1.925651 0.153332 -3.482848
H  1.984572 2.920434 1.33391
H  0.431805 3.683372 1.022976
H  1.204562 2.722043 -0.2336
H  4.094234 -1.072729 -0.251528
H  4.43132 0.054226 -1.566156
H  -1.406961 -3.21105 1.3259
H  -2.235571 -1.655247 1.158113
H  4.340182 1.96136 0.028271
H  3.972501 0.856716 1.345378
H  6.549312 0.787986 -0.32278
H  6.17697 -0.292847 1.017756
H  6.405235 1.426245 1.309497
elementType: Cl O N C H
totalener: -1328.99532564 hartree
nucrepener: 1975.06107061 hartree
electener: -3304.05639625 hartree
oneelecener: -5742.21249672 hartree
twoeener: 2438.15610047 hartree
cpcmener: -0.02386004 hartree
kineticenergy: 1324.24417357 hartree
xcener: -107.415079992754 hartree
chargesum: -0.0000000
charge: -0.155874 -0.358064 -0.494963 0.008231 0.086797 -0.153942 -0.059463 -0.084217 -0.157497 -0.146978 -0.000498 -0.073714 -0.088711 0.278114 -0.192190 -0.270067 -0.294818 0.038900 -0.054627 -0.087665 -0.276160 0.110048 0.118305 0.091390 0.086784 0.091428 0.054589 0.092519 0.094232 0.141813 0.139875 0.154927 0.088681 0.096590 0.089745 0.094837 0.096474 0.082518 0.073500 0.071871 0.145589 0.144184 0.061121 0.061422 0.080517 0.081571 0.092878
qa: -0.1559 -0.3581 -0.4950 0.0082 0.0868 -0.1539 -0.0595 -0.0842 -0.1575 -0.1470 -0.0005 -0.0737 -0.0887 0.2781 -0.1922 -0.2701 -0.2948 0.0389 -0.0546 -0.0877 -0.2762 0.1100 0.1183 0.0914 0.0868 0.0914 0.0546 0.0925 0.0942 0.1418 0.1399 0.1549 0.0887 0.0966 0.0897 0.0948 0.0965 0.0825 0.0735 0.0719 0.1456 0.1442 0.0611 0.0614 0.0805 0.0816 0.0929
va: 1.1182 1.9494 2.0147 2.9482 3.6194 3.8077 3.7268 3.8831 3.8673 3.7976 3.9279 3.8150 3.8056 4.1498 3.9731 3.9113 3.9318 3.8906 3.9456 3.8934 3.9661 1.0085 0.9977 1.0035 1.0150 1.0047 1.0615 1.0130 0.9971 0.9968 0.9985 0.9919 1.0035 1.0035 0.9992 1.0011 1.0104 1.0133 0.9933 0.9906 1.0113 1.0067 1.0067 1.0069 1.0016 1.0014 1.0030
dispcorr: -0.027190988 hartree
energy: -1329.022516630506
dipole: 15.93256 -16.75443 -0.82187 13.59416 -12.54947 1.04469 -15.12262 14.20863 -0.91399
magnitude: 1.61314 au
magnitude: 4.10028 debye
